Compiling r1725 failed in Windows XP

classic Classic list List threaded Threaded
2 messages Options
Reply | Threaded
Open this post in threaded view
|

Compiling r1725 failed in Windows XP

Junggon Kim
Hi Rosen,

I'm trying to install OpenRAVE r1725, the latest version, in Windows
XP, but I got the following error messages during ALL_BUILD. All the
errors are about the log printing functions. Thanks.

-Junggon

------
1>------ Build started: Project: qtcoinrave, Configuration: Release Win32 ------
2>------ Build started: Project: libopenrave-core, Configuration:
Release Win32 ------
3>------ Build started: Project: ikfastsolvers, Configuration: Release
Win32 ------
2>Compiling...
1>Compiling...
4>------ Build started: Project: dualmanipulation, Configuration:
Release Win32 ------
3>Compiling...
4>Compiling...
1>cl : Command line warning D9025 : overriding '/EHc' with '/EHc-'
1>qtcoinviewer.cpp
2>cl : Command line warning D9025 : overriding '/EHc' with '/EHc-'
2>openrave-core.cpp
4>cl : Command line warning D9025 : overriding '/EHc' with '/EHc-'
4>dualmanipulation.cpp
3>cl : Command line warning D9025 : overriding '/EHc' with '/EHc-'
3>ikfastsolvers.cpp
2>using native typeof
4>using native typeof
3>using native typeof
1>using native typeof
3>c:\_users\junggon\works\projects\toyota_manip\data\openrave_source\openrave_1725\plugins\ikfastsolvers\ikfastproblem.h(47)
: warning C4305: '-=' : truncation from 'double' to 'float'
3>c:\_users\junggon\works\projects\toyota_manip\data\openrave_source\openrave_1725\plugins\ikfastsolvers\ikfastproblem.h(49)
: warning C4305: '+=' : truncation from 'double' to 'float'
4>c:\_users\junggon\works\projects\toyota_manip\data\openrave_source\openrave_1725\plugins\dualmanipulation\dualmanipulation.h(302)
: error C2039: 'RavePrintfA_INFOLEVEL' : is not a member of 'OpenRAVE'
4>c:\_users\junggon\works\projects\toyota_manip\data\openrave_source\openrave_1725\plugins\dualmanipulation\dualmanipulation.h(302)
: error C2039: 'RavePrintfA_INFOLEVEL' : is not a member of 'OpenRAVE'
4>c:\_users\junggon\works\projects\toyota_manip\data\openrave_source\openrave_1725\plugins\dualmanipulation\dualmanipulation.h(302)
: error C3861: 'RavePrintfA_INFOLEVEL': identifier not found
4>c:\_users\junggon\works\projects\toyota_manip\data\openrave_source\openrave_1725\plugins\dualmanipulation\dualmanipulation.h(302)
: error C3861: 'RavePrintfA_INFOLEVEL': identifier not found
4>c:\_users\junggon\works\projects\toyota_manip\data\openrave_source\openrave_1725\plugins\dualmanipulation\dualmanipulation.h(308)
: error C2039: 'RavePrintfA_INFOLEVEL' : is not a member of 'OpenRAVE'
4>c:\_users\junggon\works\projects\toyota_manip\data\openrave_source\openrave_1725\plugins\dualmanipulation\dualmanipulation.h(308)
: error C2039: 'RavePrintfA_INFOLEVEL' : is not a member of 'OpenRAVE'
4>c:\_users\junggon\works\projects\toyota_manip\data\openrave_source\openrave_1725\plugins\dualmanipulation\dualmanipulation.h(308)
: error C3861: 'RavePrintfA_INFOLEVEL': identifier not found
4>c:\_users\junggon\works\projects\toyota_manip\data\openrave_source\openrave_1725\plugins\dualmanipulation\dualmanipulation.h(308)
: error C3861: 'RavePrintfA_INFOLEVEL': identifier not found
4>c:\_users\junggon\works\projects\toyota_manip\data\openrave_source\openrave_1725\plugins\dualmanipulation\dualmanipulation.h(454)
: warning C4244: 'argument' : conversion from 'double' to 'float',
possible loss of data
4>Build log was saved at
"file://c:\_Users\Junggon\Works\Projects\toyota_manip\data\openrave_source\OpenRAVE_1725\build\plugins\dualmanipulation\dualmanipulation.dir\Release\BuildLog.htm"
4>dualmanipulation - 8 error(s), 2 warning(s)
3>c:\_users\junggon\works\projects\toyota_manip\data\openrave_source\openrave_1725\plugins\ikfastsolvers\ikfastproblem.h(871)
: warning C4244: 'argument' : conversion from 'double' to 'float',
possible loss of data
3>c:\_users\junggon\works\projects\toyota_manip\data\openrave_source\openrave_1725\plugins\ikfastsolvers\ikfastproblem.h(925)
: error C2039: 'RavePrintfA_INFOLEVEL' : is not a member of 'OpenRAVE'
3>c:\_users\junggon\works\projects\toyota_manip\data\openrave_source\openrave_1725\plugins\ikfastsolvers\ikfastproblem.h(925)
: error C2039: 'RavePrintfA_INFOLEVEL' : is not a member of 'OpenRAVE'
3>c:\_users\junggon\works\projects\toyota_manip\data\openrave_source\openrave_1725\plugins\ikfastsolvers\ikfastproblem.h(925)
: error C3861: 'RavePrintfA_INFOLEVEL': identifier not found
3>c:\_users\junggon\works\projects\toyota_manip\data\openrave_source\openrave_1725\plugins\ikfastsolvers\ikfastproblem.h(925)
: error C3861: 'RavePrintfA_INFOLEVEL': identifier not found
3>c:\_users\junggon\works\projects\toyota_manip\data\openrave_source\openrave_1725\plugins\ikfastsolvers\ik_barrettwam.h(87)
: warning C4305: 'return' : truncation from 'double' to 'float'
3>c:\_users\junggon\works\projects\toyota_manip\data\openrave_source\openrave_1725\plugins\ikfastsolvers\ik_barrettwam.h(88)
: warning C4305: 'return' : truncation from 'double' to 'float'
3>c:\_users\junggon\works\projects\toyota_manip\data\openrave_source\openrave_1725\plugins\ikfastsolvers\ik_barrettwam.h(102)
: warning C4305: 'return' : truncation from 'double' to 'float'
3>c:\_users\junggon\works\projects\toyota_manip\data\openrave_source\openrave_1725\plugins\ikfastsolvers\ik_barrettwam.h(122)
: warning C4305: 'return' : truncation from 'double' to 'float'
3>c:\_users\junggon\works\projects\toyota_manip\data\openrave_source\openrave_1725\plugins\ikfastsolvers\ik_pa10.h(87)
: warning C4305: 'return' : truncation from 'double' to 'float'
3>c:\_users\junggon\works\projects\toyota_manip\data\openrave_source\openrave_1725\plugins\ikfastsolvers\ik_pa10.h(88)
: warning C4305: 'return' : truncation from 'double' to 'float'
3>c:\_users\junggon\works\projects\toyota_manip\data\openrave_source\openrave_1725\plugins\ikfastsolvers\ik_pa10.h(102)
: warning C4305: 'return' : truncation from 'double' to 'float'
3>c:\_users\junggon\works\projects\toyota_manip\data\openrave_source\openrave_1725\plugins\ikfastsolvers\ik_pa10.h(122)
: warning C4305: 'return' : truncation from 'double' to 'float'
3>c:\_users\junggon\works\projects\toyota_manip\data\openrave_source\openrave_1725\plugins\ikfastsolvers\ik_puma.h(87)
: warning C4305: 'return' : truncation from 'double' to 'float'
3>c:\_users\junggon\works\projects\toyota_manip\data\openrave_source\openrave_1725\plugins\ikfastsolvers\ik_puma.h(88)
: warning C4305: 'return' : truncation from 'double' to 'float'
3>c:\_users\junggon\works\projects\toyota_manip\data\openrave_source\openrave_1725\plugins\ikfastsolvers\ik_puma.h(102)
: warning C4305: 'return' : truncation from 'double' to 'float'
3>c:\_users\junggon\works\projects\toyota_manip\data\openrave_source\openrave_1725\plugins\ikfastsolvers\ik_puma.h(122)
: warning C4305: 'return' : truncation from 'double' to 'float'
3>c:\_users\junggon\works\projects\toyota_manip\data\openrave_source\openrave_1725\plugins\ikfastsolvers\ik_manusleftarm.h(87)
: warning C4305: 'return' : truncation from 'double' to 'float'
3>c:\_users\junggon\works\projects\toyota_manip\data\openrave_source\openrave_1725\plugins\ikfastsolvers\ik_manusleftarm.h(88)
: warning C4305: 'return' : truncation from 'double' to 'float'
3>c:\_users\junggon\works\projects\toyota_manip\data\openrave_source\openrave_1725\plugins\ikfastsolvers\ik_manusleftarm.h(102)
: warning C4305: 'return' : truncation from 'double' to 'float'
3>c:\_users\junggon\works\projects\toyota_manip\data\openrave_source\openrave_1725\plugins\ikfastsolvers\ik_manusleftarm.h(122)
: warning C4305: 'return' : truncation from 'double' to 'float'
3>c:\_users\junggon\works\projects\toyota_manip\data\openrave_source\openrave_1725\plugins\ikfastsolvers\ik_man1left.h(87)
: warning C4305: 'return' : truncation from 'double' to 'float'
3>c:\_users\junggon\works\projects\toyota_manip\data\openrave_source\openrave_1725\plugins\ikfastsolvers\ik_man1left.h(88)
: warning C4305: 'return' : truncation from 'double' to 'float'
3>c:\_users\junggon\works\projects\toyota_manip\data\openrave_source\openrave_1725\plugins\ikfastsolvers\ik_man1left.h(102)
: warning C4305: 'return' : truncation from 'double' to 'float'
3>c:\_users\junggon\works\projects\toyota_manip\data\openrave_source\openrave_1725\plugins\ikfastsolvers\ik_man1left.h(122)
: warning C4305: 'return' : truncation from 'double' to 'float'
3>c:\_users\junggon\works\projects\toyota_manip\data\openrave_source\openrave_1725\plugins\ikfastsolvers\ik_man1right.h(87)
: warning C4305: 'return' : truncation from 'double' to 'float'
3>c:\_users\junggon\works\projects\toyota_manip\data\openrave_source\openrave_1725\plugins\ikfastsolvers\ik_man1right.h(88)
: warning C4305: 'return' : truncation from 'double' to 'float'
3>c:\_users\junggon\works\projects\toyota_manip\data\openrave_source\openrave_1725\plugins\ikfastsolvers\ik_man1right.h(102)
: warning C4305: 'return' : truncation from 'double' to 'float'
3>c:\_users\junggon\works\projects\toyota_manip\data\openrave_source\openrave_1725\plugins\ikfastsolvers\ik_man1right.h(122)
: warning C4305: 'return' : truncation from 'double' to 'float'
3>c:\_users\junggon\works\projects\toyota_manip\data\openrave_source\openrave_1725\plugins\ikfastsolvers\ik_katana.h(87)
: warning C4305: 'return' : truncation from 'double' to 'float'
3>c:\_users\junggon\works\projects\toyota_manip\data\openrave_source\openrave_1725\plugins\ikfastsolvers\ik_katana.h(88)
: warning C4305: 'return' : truncation from 'double' to 'float'
3>c:\_users\junggon\works\projects\toyota_manip\data\openrave_source\openrave_1725\plugins\ikfastsolvers\ik_katana.h(102)
: warning C4305: 'return' : truncation from 'double' to 'float'
2>c:\_users\junggon\works\projects\toyota_manip\data\openrave_source\openrave_1725\src\libopenrave-core\xmlreaders.h(599)
: warning C4996: 'stricmp': The POSIX name for this item is
deprecated. Instead, use the ISO C++ conformant name: _stricmp. See
online help for details.
3>c:\_users\junggon\works\projects\toyota_manip\data\openrave_source\openrave_1725\plugins\ikfastsolvers\ik_katana.h(122)
: warning C4305: 'return' : truncation from 'double' to 'float'
2>        C:\Program Files\Microsoft Visual Studio
9.0\VC\include\string.h(215) : see declaration of 'stricmp'
3>Build log was saved at
"file://c:\_Users\Junggon\Works\Projects\toyota_manip\data\openrave_source\OpenRAVE_1725\build\plugins\ikfastsolvers\ikfastsolvers.dir\Release\BuildLog.htm"
3>ikfastsolvers - 4 error(s), 32 warning(s)
2>c:\_users\junggon\works\projects\toyota_manip\data\openrave_source\openrave_1725\src\libopenrave-core\xmlreaders.h(664)
: warning C4996: 'stricmp': The POSIX name for this item is
deprecated. Instead, use the ISO C++ conformant name: _stricmp. See
online help for details.
2>        C:\Program Files\Microsoft Visual Studio
9.0\VC\include\string.h(215) : see declaration of 'stricmp'
5>------ Build started: Project: rplanners, Configuration: Release Win32 ------
2>c:\_users\junggon\works\projects\toyota_manip\data\openrave_source\openrave_1725\src\libopenrave-core\xmlreaders.h(667)
: warning C4996: 'stricmp': The POSIX name for this item is
deprecated. Instead, use the ISO C++ conformant name: _stricmp. See
online help for details.
2>        C:\Program Files\Microsoft Visual Studio
9.0\VC\include\string.h(215) : see declaration of 'stricmp'
2>c:\_users\junggon\works\projects\toyota_manip\data\openrave_source\openrave_1725\src\libopenrave-core\xmlreaders.h(671)
: error C2039: 'RavePrintfA_INFOLEVEL' : is not a member of 'OpenRAVE'
5>Compiling...
2>c:\_users\junggon\works\projects\toyota_manip\data\openrave_source\openrave_1725\src\libopenrave-core\xmlreaders.h(671)
: error C2039: 'RavePrintfA_INFOLEVEL' : is not a member of 'OpenRAVE'
2>c:\_users\junggon\works\projects\toyota_manip\data\openrave_source\openrave_1725\src\libopenrave-core\xmlreaders.h(671)
: error C3861: 'RavePrintfA_INFOLEVEL': identifier not found
2>c:\_users\junggon\works\projects\toyota_manip\data\openrave_source\openrave_1725\src\libopenrave-core\xmlreaders.h(671)
: error C3861: 'RavePrintfA_INFOLEVEL': identifier not found
2>c:\_users\junggon\works\projects\toyota_manip\data\openrave_source\openrave_1725\src\libopenrave-core\xmlreaders.h(1590)
: error C2039: 'RavePrintfA_INFOLEVEL' : is not a member of 'OpenRAVE'
2>c:\_users\junggon\works\projects\toyota_manip\data\openrave_source\openrave_1725\src\libopenrave-core\xmlreaders.h(1590)
: error C2039: 'RavePrintfA_INFOLEVEL' : is not a member of 'OpenRAVE'
2>c:\_users\junggon\works\projects\toyota_manip\data\openrave_source\openrave_1725\src\libopenrave-core\xmlreaders.h(1590)
: error C3861: 'RavePrintfA_INFOLEVEL': identifier not found
2>c:\_users\junggon\works\projects\toyota_manip\data\openrave_source\openrave_1725\src\libopenrave-core\xmlreaders.h(1590)
: error C3861: 'RavePrintfA_INFOLEVEL': identifier not found
2>c:\_users\junggon\works\projects\toyota_manip\data\openrave_source\openrave_1725\src\libopenrave-core\xmlreaders.h(1815)
: error C2039: 'RavePrintfA_INFOLEVEL' : is not a member of 'OpenRAVE'
2>c:\_users\junggon\works\projects\toyota_manip\data\openrave_source\openrave_1725\src\libopenrave-core\xmlreaders.h(1815)
: error C2039: 'RavePrintfA_INFOLEVEL' : is not a member of 'OpenRAVE'
2>c:\_users\junggon\works\projects\toyota_manip\data\openrave_source\openrave_1725\src\libopenrave-core\xmlreaders.h(1815)
: error C3861: 'RavePrintfA_INFOLEVEL': identifier not found
2>c:\_users\junggon\works\projects\toyota_manip\data\openrave_source\openrave_1725\src\libopenrave-core\xmlreaders.h(1815)
: error C3861: 'RavePrintfA_INFOLEVEL': identifier not found
2>c:\_users\junggon\works\projects\toyota_manip\data\openrave_source\openrave_1725\src\libopenrave-core\xmlreaders.h(2316)
: error C2039: 'RavePrintfA_INFOLEVEL' : is not a member of 'OpenRAVE'
2>c:\_users\junggon\works\projects\toyota_manip\data\openrave_source\openrave_1725\src\libopenrave-core\xmlreaders.h(2316)
: error C2039: 'RavePrintfA_INFOLEVEL' : is not a member of 'OpenRAVE'
2>c:\_users\junggon\works\projects\toyota_manip\data\openrave_source\openrave_1725\src\libopenrave-core\xmlreaders.h(2316)
: error C3861: 'RavePrintfA_INFOLEVEL': identifier not found
2>c:\_users\junggon\works\projects\toyota_manip\data\openrave_source\openrave_1725\src\libopenrave-core\xmlreaders.h(2316)
: error C3861: 'RavePrintfA_INFOLEVEL': identifier not found
2>c:\_users\junggon\works\projects\toyota_manip\data\openrave_source\openrave_1725\src\libopenrave-core\xmlreaders.h(2318)
: error C2039: 'RavePrintfA_INFOLEVEL' : is not a member of 'OpenRAVE'
2>c:\_users\junggon\works\projects\toyota_manip\data\openrave_source\openrave_1725\src\libopenrave-core\xmlreaders.h(2318)
: error C2039: 'RavePrintfA_INFOLEVEL' : is not a member of 'OpenRAVE'
2>c:\_users\junggon\works\projects\toyota_manip\data\openrave_source\openrave_1725\src\libopenrave-core\xmlreaders.h(2318)
: error C3861: 'RavePrintfA_INFOLEVEL': identifier not found
2>c:\_users\junggon\works\projects\toyota_manip\data\openrave_source\openrave_1725\src\libopenrave-core\xmlreaders.h(2318)
: error C3861: 'RavePrintfA_INFOLEVEL': identifier not found
5>cl : Command line warning D9025 : overriding '/EHc' with '/EHc-'
5>rplanners.cpp
2>c:\_users\junggon\works\projects\toyota_manip\data\openrave_source\openrave_1725\src\libopenrave-core\environment.h(1147)
: error C2039: 'RavePrintfA_INFOLEVEL' : is not a member of 'OpenRAVE'
2>c:\_users\junggon\works\projects\toyota_manip\data\openrave_source\openrave_1725\src\libopenrave-core\environment.h(1147)
: error C2039: 'RavePrintfA_INFOLEVEL' : is not a member of 'OpenRAVE'
2>c:\_users\junggon\works\projects\toyota_manip\data\openrave_source\openrave_1725\src\libopenrave-core\environment.h(1147)
: error C3861: 'RavePrintfA_INFOLEVEL': identifier not found
2>c:\_users\junggon\works\projects\toyota_manip\data\openrave_source\openrave_1725\src\libopenrave-core\environment.h(1147)
: error C3861: 'RavePrintfA_INFOLEVEL': identifier not found
6>------ Build started: Project: textserver, Configuration: Release Win32 ------
6>Compiling...
6>cl : Command line warning D9025 : overriding '/EHc' with '/EHc-'
6>textserver.cpp
1>..\..\..\plugins\qtcoinrave\qtcoinviewer.cpp(236) : error C2039:
'RavePrintfA_INFOLEVEL' : is not a member of 'OpenRAVE'
1>..\..\..\plugins\qtcoinrave\qtcoinviewer.cpp(236) : error C2039:
'RavePrintfA_INFOLEVEL' : is not a member of 'OpenRAVE'
1>..\..\..\plugins\qtcoinrave\qtcoinviewer.cpp(236) : error C3861:
'RavePrintfA_INFOLEVEL': identifier not found
1>..\..\..\plugins\qtcoinrave\qtcoinviewer.cpp(236) : error C3861:
'RavePrintfA_INFOLEVEL': identifier not found
1>..\..\..\plugins\qtcoinrave\qtcoinviewer.cpp(1042) : error C2039:
'RavePrintfA_INFOLEVEL' : is not a member of 'OpenRAVE'
1>..\..\..\plugins\qtcoinrave\qtcoinviewer.cpp(1042) : error C2039:
'RavePrintfA_INFOLEVEL' : is not a member of 'OpenRAVE'
1>..\..\..\plugins\qtcoinrave\qtcoinviewer.cpp(1042) : error C3861:
'RavePrintfA_INFOLEVEL': identifier not found
1>..\..\..\plugins\qtcoinrave\qtcoinviewer.cpp(1042) : error C3861:
'RavePrintfA_INFOLEVEL': identifier not found
1>..\..\..\plugins\qtcoinrave\qtcoinviewer.cpp(2669) : error C2039:
'RavePrintfA_INFOLEVEL' : is not a member of 'OpenRAVE'
1>..\..\..\plugins\qtcoinrave\qtcoinviewer.cpp(2669) : error C2039:
'RavePrintfA_INFOLEVEL' : is not a member of 'OpenRAVE'
1>..\..\..\plugins\qtcoinrave\qtcoinviewer.cpp(2669) : error C3861:
'RavePrintfA_INFOLEVEL': identifier not found
1>..\..\..\plugins\qtcoinrave\qtcoinviewer.cpp(2669) : error C3861:
'RavePrintfA_INFOLEVEL': identifier not found
1>..\..\..\plugins\qtcoinrave\qtcoinviewer.cpp(2817) : error C2039:
'RavePrintfA_INFOLEVEL' : is not a member of 'OpenRAVE'
1>..\..\..\plugins\qtcoinrave\qtcoinviewer.cpp(2817) : error C2039:
'RavePrintfA_INFOLEVEL' : is not a member of 'OpenRAVE'
1>..\..\..\plugins\qtcoinrave\qtcoinviewer.cpp(2817) : error C3861:
'RavePrintfA_INFOLEVEL': identifier not found
1>..\..\..\plugins\qtcoinrave\qtcoinviewer.cpp(2817) : error C3861:
'RavePrintfA_INFOLEVEL': identifier not found
5>using native typeof
6>using native typeof
5>c:\_users\junggon\works\projects\toyota_manip\data\openrave_source\openrave_1725\plugins\rplanners\graspgradient.h(255)
: error C2039: 'RavePrintfA_INFOLEVEL' : is not a member of 'OpenRAVE'
5>c:\_users\junggon\works\projects\toyota_manip\data\openrave_source\openrave_1725\plugins\rplanners\graspgradient.h(255)
: error C2039: 'RavePrintfA_INFOLEVEL' : is not a member of 'OpenRAVE'
5>c:\_users\junggon\works\projects\toyota_manip\data\openrave_source\openrave_1725\plugins\rplanners\graspgradient.h(255)
: error C3861: 'RavePrintfA_INFOLEVEL': identifier not found
5>c:\_users\junggon\works\projects\toyota_manip\data\openrave_source\openrave_1725\plugins\rplanners\graspgradient.h(255)
: error C3861: 'RavePrintfA_INFOLEVEL': identifier not found
5>c:\_users\junggon\works\projects\toyota_manip\data\openrave_source\openrave_1725\plugins\rplanners\graspgradient.h(336)
: error C2039: 'RavePrintfA_INFOLEVEL' : is not a member of 'OpenRAVE'
5>c:\_users\junggon\works\projects\toyota_manip\data\openrave_source\openrave_1725\plugins\rplanners\graspgradient.h(336)
: error C2039: 'RavePrintfA_INFOLEVEL' : is not a member of 'OpenRAVE'
5>c:\_users\junggon\works\projects\toyota_manip\data\openrave_source\openrave_1725\plugins\rplanners\graspgradient.h(336)
: error C3861: 'RavePrintfA_INFOLEVEL': identifier not found
5>c:\_users\junggon\works\projects\toyota_manip\data\openrave_source\openrave_1725\plugins\rplanners\graspgradient.h(336)
: error C3861: 'RavePrintfA_INFOLEVEL': identifier not found
5>Build log was saved at
"file://c:\_Users\Junggon\Works\Projects\toyota_manip\data\openrave_source\OpenRAVE_1725\build\plugins\rplanners\rplanners.dir\Release\BuildLog.htm"
5>rplanners - 8 error(s), 1 warning(s)
2>c:\_users\junggon\works\projects\toyota_manip\data\openrave_source\openrave_1725\src\libopenrave-core\colladareader.h(750)
: error C2039: 'RavePrintfA_INFOLEVEL' : is not a member of 'OpenRAVE'
2>c:\_users\junggon\works\projects\toyota_manip\data\openrave_source\openrave_1725\src\libopenrave-core\colladareader.h(750)
: error C2039: 'RavePrintfA_INFOLEVEL' : is not a member of 'OpenRAVE'
2>c:\_users\junggon\works\projects\toyota_manip\data\openrave_source\openrave_1725\src\libopenrave-core\colladareader.h(750)
: error C3861: 'RavePrintfA_INFOLEVEL': identifier not found
2>c:\_users\junggon\works\projects\toyota_manip\data\openrave_source\openrave_1725\src\libopenrave-core\colladareader.h(750)
: error C3861: 'RavePrintfA_INFOLEVEL': identifier not found
2>c:\_users\junggon\works\projects\toyota_manip\data\openrave_source\openrave_1725\src\libopenrave-core\colladareader.h(1129)
: error C2039: 'RavePrintfA_INFOLEVEL' : is not a member of 'OpenRAVE'
2>c:\_users\junggon\works\projects\toyota_manip\data\openrave_source\openrave_1725\src\libopenrave-core\colladareader.h(1129)
: error C2039: 'RavePrintfA_INFOLEVEL' : is not a member of 'OpenRAVE'
2>c:\_users\junggon\works\projects\toyota_manip\data\openrave_source\openrave_1725\src\libopenrave-core\colladareader.h(1129)
: error C3861: 'RavePrintfA_INFOLEVEL': identifier not found
2>c:\_users\junggon\works\projects\toyota_manip\data\openrave_source\openrave_1725\src\libopenrave-core\colladareader.h(1129)
: error C3861: 'RavePrintfA_INFOLEVEL': identifier not found
2>c:\_users\junggon\works\projects\toyota_manip\data\openrave_source\openrave_1725\src\libopenrave-core\colladareader.h(1424)
: error C2039: 'RavePrintfA_INFOLEVEL' : is not a member of 'OpenRAVE'
2>c:\_users\junggon\works\projects\toyota_manip\data\openrave_source\openrave_1725\src\libopenrave-core\colladareader.h(1424)
: error C2039: 'RavePrintfA_INFOLEVEL' : is not a member of 'OpenRAVE'
2>c:\_users\junggon\works\projects\toyota_manip\data\openrave_source\openrave_1725\src\libopenrave-core\colladareader.h(1424)
: error C3861: 'RavePrintfA_INFOLEVEL': identifier not found
2>c:\_users\junggon\works\projects\toyota_manip\data\openrave_source\openrave_1725\src\libopenrave-core\colladareader.h(1424)
: error C3861: 'RavePrintfA_INFOLEVEL': identifier not found
2>c:\_users\junggon\works\projects\toyota_manip\data\openrave_source\openrave_1725\src\libopenrave-core\colladareader.h(1436)
: error C2039: 'RavePrintfA_INFOLEVEL' : is not a member of 'OpenRAVE'
2>c:\_users\junggon\works\projects\toyota_manip\data\openrave_source\openrave_1725\src\libopenrave-core\colladareader.h(1436)
: error C2039: 'RavePrintfA_INFOLEVEL' : is not a member of 'OpenRAVE'
2>c:\_users\junggon\works\projects\toyota_manip\data\openrave_source\openrave_1725\src\libopenrave-core\colladareader.h(1436)
: error C3861: 'RavePrintfA_INFOLEVEL': identifier not found
2>c:\_users\junggon\works\projects\toyota_manip\data\openrave_source\openrave_1725\src\libopenrave-core\colladareader.h(1436)
: error C3861: 'RavePrintfA_INFOLEVEL': identifier not found
2>c:\_users\junggon\works\projects\toyota_manip\data\openrave_source\openrave_1725\src\libopenrave-core\colladareader.h(1696)
: error C2039: 'RavePrintfA_INFOLEVEL' : is not a member of 'OpenRAVE'
2>c:\_users\junggon\works\projects\toyota_manip\data\openrave_source\openrave_1725\src\libopenrave-core\colladareader.h(1696)
: error C2039: 'RavePrintfA_INFOLEVEL' : is not a member of 'OpenRAVE'
2>c:\_users\junggon\works\projects\toyota_manip\data\openrave_source\openrave_1725\src\libopenrave-core\colladareader.h(1696)
: error C3861: 'RavePrintfA_INFOLEVEL': identifier not found
6>c:\_users\junggon\works\projects\toyota_manip\data\openrave_source\openrave_1725\plugins\textserver\textserver.h(384)
: error C2039: 'RavePrintfA_INFOLEVEL' : is not a member of 'OpenRAVE'
2>c:\_users\junggon\works\projects\toyota_manip\data\openrave_source\openrave_1725\src\libopenrave-core\colladareader.h(1696)
: error C3861: 'RavePrintfA_INFOLEVEL': identifier not found
6>c:\_users\junggon\works\projects\toyota_manip\data\openrave_source\openrave_1725\plugins\textserver\textserver.h(384)
: error C2039: 'RavePrintfA_INFOLEVEL' : is not a member of 'OpenRAVE'
2>c:\_users\junggon\works\projects\toyota_manip\data\openrave_source\openrave_1725\src\libopenrave-core\colladareader.h(1930)
: warning C4244: 'initializing' : conversion from 'domUint' to 'int',
possible loss of data
2>c:\_users\junggon\works\projects\toyota_manip\data\openrave_source\openrave_1725\src\libopenrave-core\colladareader.h(1964)
: warning C4244: 'argument' : conversion from 'domUint' to 'unsigned
int', possible loss of data
6>c:\_users\junggon\works\projects\toyota_manip\data\openrave_source\openrave_1725\plugins\textserver\textserver.h(384)
: error C3861: 'RavePrintfA_INFOLEVEL': identifier not found
2>c:\_users\junggon\works\projects\toyota_manip\data\openrave_source\openrave_1725\src\libopenrave-core\colladareader.h(1966)
: warning C4244: 'argument' : conversion from 'domUint' to 'unsigned
int', possible loss of data
6>c:\_users\junggon\works\projects\toyota_manip\data\openrave_source\openrave_1725\plugins\textserver\textserver.h(384)
: error C3861: 'RavePrintfA_INFOLEVEL': identifier not found
2>c:\_users\junggon\works\projects\toyota_manip\data\openrave_source\openrave_1725\src\libopenrave-core\colladareader.h(1971)
: warning C4244: 'initializing' : conversion from 'const domUint' to
'int', possible loss of data
2>c:\_users\junggon\works\projects\toyota_manip\data\openrave_source\openrave_1725\src\libopenrave-core\colladareader.h(2029)
: warning C4244: 'initializing' : conversion from 'domUint' to 'int',
possible loss of data
2>c:\_users\junggon\works\projects\toyota_manip\data\openrave_source\openrave_1725\src\libopenrave-core\colladareader.h(2065)
: warning C4244: 'argument' : conversion from 'domUint' to 'unsigned
int', possible loss of data
2>c:\_users\junggon\works\projects\toyota_manip\data\openrave_source\openrave_1725\src\libopenrave-core\colladareader.h(2067)
: warning C4244: 'argument' : conversion from 'domUint' to 'unsigned
int', possible loss of data
2>c:\_users\junggon\works\projects\toyota_manip\data\openrave_source\openrave_1725\src\libopenrave-core\colladareader.h(2073)
: warning C4244: 'initializing' : conversion from 'domUint' to 'int',
possible loss of data
2>c:\_users\junggon\works\projects\toyota_manip\data\openrave_source\openrave_1725\src\libopenrave-core\colladareader.h(2122)
: warning C4244: 'initializing' : conversion from 'domUint' to 'int',
possible loss of data
2>c:\_users\junggon\works\projects\toyota_manip\data\openrave_source\openrave_1725\src\libopenrave-core\colladareader.h(2158)
: warning C4244: 'argument' : conversion from 'domUint' to 'unsigned
int', possible loss of data
2>c:\_users\junggon\works\projects\toyota_manip\data\openrave_source\openrave_1725\src\libopenrave-core\colladareader.h(2160)
: warning C4244: 'argument' : conversion from 'domUint' to 'unsigned
int', possible loss of data
2>c:\_users\junggon\works\projects\toyota_manip\data\openrave_source\openrave_1725\src\libopenrave-core\colladareader.h(2166)
: warning C4244: 'initializing' : conversion from 'domUint' to 'int',
possible loss of data
2>c:\_users\junggon\works\projects\toyota_manip\data\openrave_source\openrave_1725\src\libopenrave-core\colladareader.h(2310)
: warning C4244: 'argument' : conversion from 'domUint' to 'unsigned
int', possible loss of data
2>c:\_users\junggon\works\projects\toyota_manip\data\openrave_source\openrave_1725\src\libopenrave-core\colladareader.h(2345)
: warning C4244: 'argument' : conversion from 'domUint' to 'unsigned
int', possible loss of data
2>Build log was saved at
"file://c:\_Users\Junggon\Works\Projects\toyota_manip\data\openrave_source\OpenRAVE_1725\build\src\libopenrave-core\libopenrave-core.dir\Release\BuildLog.htm"
1>Build log was saved at
"file://c:\_Users\Junggon\Works\Projects\toyota_manip\data\openrave_source\OpenRAVE_1725\build\plugins\qtcoinrave\qtcoinrave.dir\Release\BuildLog.htm"
2>libopenrave-core - 44 error(s), 18 warning(s)
1>qtcoinrave - 16 error(s), 1 warning(s)
7>------ Build started: Project: rmanipulation, Configuration: Release
Win32 ------
7>Compiling...
6>c:\_users\junggon\works\projects\toyota_manip\data\openrave_source\openrave_1725\plugins\textserver\textserver.h(1956)
: warning C4244: 'argument' : conversion from 'OpenRAVE::dReal' to
'const float', possible loss of data
6>c:\_users\junggon\works\projects\toyota_manip\data\openrave_source\openrave_1725\plugins\textserver\textserver.h(1956)
: warning C4244: 'argument' : conversion from 'OpenRAVE::dReal' to
'const float', possible loss of data
6>c:\_users\junggon\works\projects\toyota_manip\data\openrave_source\openrave_1725\plugins\textserver\textserver.h(1956)
: warning C4244: 'argument' : conversion from 'OpenRAVE::dReal' to
'const float', possible loss of data
6>c:\_users\junggon\works\projects\toyota_manip\data\openrave_source\openrave_1725\plugins\textserver\textserver.h(1957)
: warning C4244: 'argument' : conversion from 'OpenRAVE::dReal' to
'const float', possible loss of data
6>c:\_users\junggon\works\projects\toyota_manip\data\openrave_source\openrave_1725\plugins\textserver\textserver.h(1957)
: warning C4244: 'argument' : conversion from 'OpenRAVE::dReal' to
'const float', possible loss of data
6>c:\_users\junggon\works\projects\toyota_manip\data\openrave_source\openrave_1725\plugins\textserver\textserver.h(1957)
: warning C4244: 'argument' : conversion from 'OpenRAVE::dReal' to
'const float', possible loss of data
7>cl : Command line warning D9025 : overriding '/EHc' with '/EHc-'
6>Build log was saved at
"file://c:\_Users\Junggon\Works\Projects\toyota_manip\data\openrave_source\OpenRAVE_1725\build\plugins\textserver\textserver.dir\Release\BuildLog.htm"
7>rmanipulation.cpp
6>textserver - 4 error(s), 7 warning(s)
8>------ Build started: Project: openrave, Configuration: Release Win32 ------
9>------ Build started: Project: openravepy_int, Configuration:
Release Win32 ------
8>Compiling...
9>Compiling...
8>cl : Command line warning D9025 : overriding '/EHc' with '/EHc-'
8>openrave.cpp
9>cl : Command line warning D9025 : overriding '/EHc' with '/EHc-'
9>openravepy_int.cpp
7>using native typeof
8>..\..\src\openrave.cpp(94) : warning C4996: 'stricmp': The POSIX
name for this item is deprecated. Instead, use the ISO C++ conformant
name: _stricmp. See online help for details.
8>        C:\Program Files\Microsoft Visual Studio
9.0\VC\include\string.h(215) : see declaration of 'stricmp'
8>..\..\src\openrave.cpp(95) : error C2039: 'RavePrintfA_INFOLEVEL' :
is not a member of 'OpenRAVE'
8>..\..\src\openrave.cpp(95) : error C2039: 'RavePrintfA_INFOLEVEL' :
is not a member of 'OpenRAVE'
8>..\..\src\openrave.cpp(95) : error C3861: 'RavePrintfA_INFOLEVEL':
identifier not found
8>..\..\src\openrave.cpp(95) : error C3861: 'RavePrintfA_INFOLEVEL':
identifier not found
8>..\..\src\openrave.cpp(191) : error C2039: 'RavePrintfA_INFOLEVEL' :
is not a member of 'OpenRAVE'
8>..\..\src\openrave.cpp(191) : error C2039: 'RavePrintfA_INFOLEVEL' :
is not a member of 'OpenRAVE'
8>..\..\src\openrave.cpp(191) : error C3861: 'RavePrintfA_INFOLEVEL':
identifier not found
8>..\..\src\openrave.cpp(191) : error C3861: 'RavePrintfA_INFOLEVEL':
identifier not found
8>Build log was saved at
"file://c:\_Users\Junggon\Works\Projects\toyota_manip\data\openrave_source\OpenRAVE_1725\build\src\openrave.dir\Release\BuildLog.htm"
8>openrave - 8 error(s), 2 warning(s)
7>c:\_users\junggon\works\projects\toyota_manip\data\openrave_source\openrave_1725\plugins\rmanipulation\basemanipulation.h(348)
: warning C4996: 'std::copy': Function call with parameters that may
be unsafe - this call relies on the caller to check that the passed
values are correct. To disable this warning, use
-D_SCL_SECURE_NO_WARNINGS. See documentation on how to use Visual C++
'Checked Iterators'
7>        C:\Program Files\Microsoft Visual Studio
9.0\VC\include\xutility(2550) : see declaration of 'std::copy'
7>c:\_users\junggon\works\projects\toyota_manip\data\openrave_source\openrave_1725\plugins\rmanipulation\basemanipulation.h(409)
: warning C4244: 'argument' : conversion from 'double' to 'float',
possible loss of data
7>c:\_users\junggon\works\projects\toyota_manip\data\openrave_source\openrave_1725\plugins\rmanipulation\basemanipulation.h(526)
: error C2039: 'RavePrintfA_INFOLEVEL' : is not a member of 'OpenRAVE'
7>c:\_users\junggon\works\projects\toyota_manip\data\openrave_source\openrave_1725\plugins\rmanipulation\basemanipulation.h(526)
: error C2039: 'RavePrintfA_INFOLEVEL' : is not a member of 'OpenRAVE'
7>c:\_users\junggon\works\projects\toyota_manip\data\openrave_source\openrave_1725\plugins\rmanipulation\basemanipulation.h(526)
: error C3861: 'RavePrintfA_INFOLEVEL': identifier not found
7>c:\_users\junggon\works\projects\toyota_manip\data\openrave_source\openrave_1725\plugins\rmanipulation\basemanipulation.h(526)
: error C3861: 'RavePrintfA_INFOLEVEL': identifier not found
7>c:\_users\junggon\works\projects\toyota_manip\data\openrave_source\openrave_1725\plugins\rmanipulation\basemanipulation.h(536)
: error C2039: 'RavePrintfA_INFOLEVEL' : is not a member of 'OpenRAVE'
7>c:\_users\junggon\works\projects\toyota_manip\data\openrave_source\openrave_1725\plugins\rmanipulation\basemanipulation.h(536)
: error C2039: 'RavePrintfA_INFOLEVEL' : is not a member of 'OpenRAVE'
7>c:\_users\junggon\works\projects\toyota_manip\data\openrave_source\openrave_1725\plugins\rmanipulation\basemanipulation.h(536)
: error C3861: 'RavePrintfA_INFOLEVEL': identifier not found
7>c:\_users\junggon\works\projects\toyota_manip\data\openrave_source\openrave_1725\plugins\rmanipulation\basemanipulation.h(536)
: error C3861: 'RavePrintfA_INFOLEVEL': identifier not found
7>c:\_users\junggon\works\projects\toyota_manip\data\openrave_source\openrave_1725\plugins\rmanipulation\basemanipulation.h(797)
: error C2039: 'RavePrintfA_INFOLEVEL' : is not a member of 'OpenRAVE'
7>c:\_users\junggon\works\projects\toyota_manip\data\openrave_source\openrave_1725\plugins\rmanipulation\basemanipulation.h(797)
: error C2039: 'RavePrintfA_INFOLEVEL' : is not a member of 'OpenRAVE'
7>c:\_users\junggon\works\projects\toyota_manip\data\openrave_source\openrave_1725\plugins\rmanipulation\basemanipulation.h(797)
: error C3861: 'RavePrintfA_INFOLEVEL': identifier not found
7>c:\_users\junggon\works\projects\toyota_manip\data\openrave_source\openrave_1725\plugins\rmanipulation\basemanipulation.h(797)
: error C3861: 'RavePrintfA_INFOLEVEL': identifier not found
7>c:\_users\junggon\works\projects\toyota_manip\data\openrave_source\openrave_1725\plugins\rmanipulation\basemanipulation.h(853)
: error C2039: 'RavePrintfA_INFOLEVEL' : is not a member of 'OpenRAVE'
7>c:\_users\junggon\works\projects\toyota_manip\data\openrave_source\openrave_1725\plugins\rmanipulation\basemanipulation.h(853)
: error C2039: 'RavePrintfA_INFOLEVEL' : is not a member of 'OpenRAVE'
7>c:\_users\junggon\works\projects\toyota_manip\data\openrave_source\openrave_1725\plugins\rmanipulation\basemanipulation.h(853)
: error C3861: 'RavePrintfA_INFOLEVEL': identifier not found
7>c:\_users\junggon\works\projects\toyota_manip\data\openrave_source\openrave_1725\plugins\rmanipulation\basemanipulation.h(853)
: error C3861: 'RavePrintfA_INFOLEVEL': identifier not found
7>c:\_users\junggon\works\projects\toyota_manip\data\openrave_source\openrave_1725\plugins\rmanipulation\basemanipulation.h(863)
: error C2039: 'RavePrintfA_INFOLEVEL' : is not a member of 'OpenRAVE'
7>c:\_users\junggon\works\projects\toyota_manip\data\openrave_source\openrave_1725\plugins\rmanipulation\basemanipulation.h(863)
: error C2039: 'RavePrintfA_INFOLEVEL' : is not a member of 'OpenRAVE'
7>c:\_users\junggon\works\projects\toyota_manip\data\openrave_source\openrave_1725\plugins\rmanipulation\basemanipulation.h(863)
: error C3861: 'RavePrintfA_INFOLEVEL': identifier not found
7>c:\_users\junggon\works\projects\toyota_manip\data\openrave_source\openrave_1725\plugins\rmanipulation\basemanipulation.h(863)
: error C3861: 'RavePrintfA_INFOLEVEL': identifier not found
7>c:\_users\junggon\works\projects\toyota_manip\data\openrave_source\openrave_1725\plugins\rmanipulation\taskmanipulation.h(378)
: error C2039: 'RavePrintfA_INFOLEVEL' : is not a member of 'OpenRAVE'
7>c:\_users\junggon\works\projects\toyota_manip\data\openrave_source\openrave_1725\plugins\rmanipulation\taskmanipulation.h(378)
: error C2039: 'RavePrintfA_INFOLEVEL' : is not a member of 'OpenRAVE'
7>c:\_users\junggon\works\projects\toyota_manip\data\openrave_source\openrave_1725\plugins\rmanipulation\taskmanipulation.h(378)
: error C3861: 'RavePrintfA_INFOLEVEL': identifier not found
7>c:\_users\junggon\works\projects\toyota_manip\data\openrave_source\openrave_1725\plugins\rmanipulation\taskmanipulation.h(378)
: error C3861: 'RavePrintfA_INFOLEVEL': identifier not found
7>c:\_users\junggon\works\projects\toyota_manip\data\openrave_source\openrave_1725\plugins\rmanipulation\taskmanipulation.h(1371)
: error C2039: 'RavePrintfA_INFOLEVEL' : is not a member of 'OpenRAVE'
7>c:\_users\junggon\works\projects\toyota_manip\data\openrave_source\openrave_1725\plugins\rmanipulation\taskmanipulation.h(1371)
: error C2039: 'RavePrintfA_INFOLEVEL' : is not a member of 'OpenRAVE'
7>c:\_users\junggon\works\projects\toyota_manip\data\openrave_source\openrave_1725\plugins\rmanipulation\taskmanipulation.h(1371)
: error C3861: 'RavePrintfA_INFOLEVEL': identifier not found
7>c:\_users\junggon\works\projects\toyota_manip\data\openrave_source\openrave_1725\plugins\rmanipulation\taskmanipulation.h(1371)
: error C3861: 'RavePrintfA_INFOLEVEL': identifier not found
7>c:\_users\junggon\works\projects\toyota_manip\data\openrave_source\openrave_1725\plugins\rmanipulation\taskmanipulation.h(1410)
: warning C4244: 'argument' : conversion from 'double' to 'float',
possible loss of data
7>c:\_users\junggon\works\projects\toyota_manip\data\openrave_source\openrave_1725\plugins\rmanipulation\taskcaging.h(228)
: warning C4244: 'argument' : conversion from 'OpenRAVE::dReal' to
'float', possible loss of data
7>c:\_users\junggon\works\projects\toyota_manip\data\openrave_source\openrave_1725\plugins\rmanipulation\taskcaging.h(228)
: warning C4244: 'argument' : conversion from 'OpenRAVE::dReal' to
'float', possible loss of data
7>c:\_users\junggon\works\projects\toyota_manip\data\openrave_source\openrave_1725\plugins\rmanipulation\taskcaging.h(228)
: warning C4244: 'argument' : conversion from 'OpenRAVE::dReal' to
'float', possible loss of data
7>c:\_users\junggon\works\projects\toyota_manip\data\openrave_source\openrave_1725\plugins\rmanipulation\taskcaging.h(252)
: warning C4244: 'return' : conversion from 'double' to 'float',
possible loss of data
7>c:\_users\junggon\works\projects\toyota_manip\data\openrave_source\openrave_1725\plugins\rmanipulation\taskcaging.h(923)
: error C2039: 'RavePrintfA_INFOLEVEL' : is not a member of 'OpenRAVE'
7>c:\_users\junggon\works\projects\toyota_manip\data\openrave_source\openrave_1725\plugins\rmanipulation\taskcaging.h(923)
: error C2039: 'RavePrintfA_INFOLEVEL' : is not a member of 'OpenRAVE'
7>c:\_users\junggon\works\projects\toyota_manip\data\openrave_source\openrave_1725\plugins\rmanipulation\taskcaging.h(923)
: error C3861: 'RavePrintfA_INFOLEVEL': identifier not found
7>c:\_users\junggon\works\projects\toyota_manip\data\openrave_source\openrave_1725\plugins\rmanipulation\taskcaging.h(923)
: error C3861: 'RavePrintfA_INFOLEVEL': identifier not found
7>c:\_users\junggon\works\projects\toyota_manip\data\openrave_source\openrave_1725\plugins\rmanipulation\visualfeedback.h(612)
: error C2039: 'RavePrintfA_INFOLEVEL' : is not a member of 'OpenRAVE'
7>c:\_users\junggon\works\projects\toyota_manip\data\openrave_source\openrave_1725\plugins\rmanipulation\visualfeedback.h(612)
: error C2039: 'RavePrintfA_INFOLEVEL' : is not a member of 'OpenRAVE'
7>c:\_users\junggon\works\projects\toyota_manip\data\openrave_source\openrave_1725\plugins\rmanipulation\visualfeedback.h(612)
: error C3861: 'RavePrintfA_INFOLEVEL': identifier not found
7>c:\_users\junggon\works\projects\toyota_manip\data\openrave_source\openrave_1725\plugins\rmanipulation\visualfeedback.h(612)
: error C3861: 'RavePrintfA_INFOLEVEL': identifier not found
7>c:\_users\junggon\works\projects\toyota_manip\data\openrave_source\openrave_1725\plugins\rmanipulation\visualfeedback.h(975)
: error C2039: 'RavePrintfA_INFOLEVEL' : is not a member of 'OpenRAVE'
7>c:\_users\junggon\works\projects\toyota_manip\data\openrave_source\openrave_1725\plugins\rmanipulation\visualfeedback.h(975)
: error C2039: 'RavePrintfA_INFOLEVEL' : is not a member of 'OpenRAVE'
7>c:\_users\junggon\works\projects\toyota_manip\data\openrave_source\openrave_1725\plugins\rmanipulation\visualfeedback.h(975)
: error C3861: 'RavePrintfA_INFOLEVEL': identifier not found
7>c:\_users\junggon\works\projects\toyota_manip\data\openrave_source\openrave_1725\plugins\rmanipulation\visualfeedback.h(975)
: error C3861: 'RavePrintfA_INFOLEVEL': identifier not found
7>c:\_users\junggon\works\projects\toyota_manip\data\openrave_source\openrave_1725\plugins\rmanipulation\visualfeedback.h(1059)
: error C2039: 'RavePrintfA_INFOLEVEL' : is not a member of 'OpenRAVE'
7>c:\_users\junggon\works\projects\toyota_manip\data\openrave_source\openrave_1725\plugins\rmanipulation\visualfeedback.h(1059)
: error C2039: 'RavePrintfA_INFOLEVEL' : is not a member of 'OpenRAVE'
7>c:\_users\junggon\works\projects\toyota_manip\data\openrave_source\openrave_1725\plugins\rmanipulation\visualfeedback.h(1059)
: error C3861: 'RavePrintfA_INFOLEVEL': identifier not found
7>c:\_users\junggon\works\projects\toyota_manip\data\openrave_source\openrave_1725\plugins\rmanipulation\visualfeedback.h(1059)
: error C3861: 'RavePrintfA_INFOLEVEL': identifier not found
7>c:\_users\junggon\works\projects\toyota_manip\data\openrave_source\openrave_1725\plugins\rmanipulation\visualfeedback.h(1068)
: error C2039: 'RavePrintfA_INFOLEVEL' : is not a member of 'OpenRAVE'
7>c:\_users\junggon\works\projects\toyota_manip\data\openrave_source\openrave_1725\plugins\rmanipulation\visualfeedback.h(1068)
: error C2039: 'RavePrintfA_INFOLEVEL' : is not a member of 'OpenRAVE'
7>c:\_users\junggon\works\projects\toyota_manip\data\openrave_source\openrave_1725\plugins\rmanipulation\visualfeedback.h(1068)
: error C3861: 'RavePrintfA_INFOLEVEL': identifier not found
7>c:\_users\junggon\works\projects\toyota_manip\data\openrave_source\openrave_1725\plugins\rmanipulation\visualfeedback.h(1068)
: error C3861: 'RavePrintfA_INFOLEVEL': identifier not found
7>c:\_users\junggon\works\projects\toyota_manip\data\openrave_source\openrave_1725\plugins\rmanipulation\visualfeedback.h(1075)
: error C2039: 'RavePrintfA_INFOLEVEL' : is not a member of 'OpenRAVE'
7>c:\_users\junggon\works\projects\toyota_manip\data\openrave_source\openrave_1725\plugins\rmanipulation\visualfeedback.h(1075)
: error C2039: 'RavePrintfA_INFOLEVEL' : is not a member of 'OpenRAVE'
7>c:\_users\junggon\works\projects\toyota_manip\data\openrave_source\openrave_1725\plugins\rmanipulation\visualfeedback.h(1075)
: error C3861: 'RavePrintfA_INFOLEVEL': identifier not found
7>c:\_users\junggon\works\projects\toyota_manip\data\openrave_source\openrave_1725\plugins\rmanipulation\visualfeedback.h(1075)
: error C3861: 'RavePrintfA_INFOLEVEL': identifier not found
7>c:\_users\junggon\works\projects\toyota_manip\data\openrave_source\openrave_1725\plugins\rmanipulation\visualfeedback.h(1162)
: error C2039: 'RavePrintfA_INFOLEVEL' : is not a member of 'OpenRAVE'
7>c:\_users\junggon\works\projects\toyota_manip\data\openrave_source\openrave_1725\plugins\rmanipulation\visualfeedback.h(1162)
: error C2039: 'RavePrintfA_INFOLEVEL' : is not a member of 'OpenRAVE'
7>c:\_users\junggon\works\projects\toyota_manip\data\openrave_source\openrave_1725\plugins\rmanipulation\visualfeedback.h(1162)
: error C3861: 'RavePrintfA_INFOLEVEL': identifier not found
7>c:\_users\junggon\works\projects\toyota_manip\data\openrave_source\openrave_1725\plugins\rmanipulation\visualfeedback.h(1162)
: error C3861: 'RavePrintfA_INFOLEVEL': identifier not found
7>c:\_users\junggon\works\projects\toyota_manip\data\openrave_source\openrave_1725\plugins\rmanipulation\visualfeedback.h(1175)
: error C2039: 'RavePrintfA_INFOLEVEL' : is not a member of 'OpenRAVE'
7>c:\_users\junggon\works\projects\toyota_manip\data\openrave_source\openrave_1725\plugins\rmanipulation\visualfeedback.h(1175)
: error C2039: 'RavePrintfA_INFOLEVEL' : is not a member of 'OpenRAVE'
7>c:\_users\junggon\works\projects\toyota_manip\data\openrave_source\openrave_1725\plugins\rmanipulation\visualfeedback.h(1175)
: error C3861: 'RavePrintfA_INFOLEVEL': identifier not found
7>c:\_users\junggon\works\projects\toyota_manip\data\openrave_source\openrave_1725\plugins\rmanipulation\visualfeedback.h(1175)
: error C3861: 'RavePrintfA_INFOLEVEL': identifier not found
7>Build log was saved at
"file://c:\_Users\Junggon\Works\Projects\toyota_manip\data\openrave_source\OpenRAVE_1725\build\plugins\rmanipulation\rmanipulation.dir\Release\BuildLog.htm"
7>rmanipulation - 60 error(s), 8 warning(s)
9>using native typeof
9>c:\_users\junggon\works\projects\toyota_manip\data\openrave_source\openrave_1725\python\bindings\bindings.h(294)
: warning C4244: 'argument' : conversion from 'uint64_t' to 'size_t',
possible loss of data
9>c:\_users\junggon\works\projects\toyota_manip\data\openrave_source\openrave_1725\python\bindings\bindings.h(320)
: warning C4244: 'argument' : conversion from 'uint64_t' to 'size_t',
possible loss of data
9>c:\_users\junggon\works\projects\toyota_manip\data\openrave_source\openrave_1725\python\bindings\bindings.h(335)
: warning C4244: 'argument' : conversion from 'uint64_t' to 'size_t',
possible loss of data
9>..\..\..\python\bindings\openravepy_int.cpp(1365) : error C2039:
'RavePrintfA_INFOLEVEL' : is not a member of 'OpenRAVE'
9>..\..\..\python\bindings\openravepy_int.cpp(1365) : error C2039:
'RavePrintfA_INFOLEVEL' : is not a member of 'OpenRAVE'
9>..\..\..\python\bindings\openravepy_int.cpp(1365) : error C3861:
'RavePrintfA_INFOLEVEL': identifier not found
9>..\..\..\python\bindings\openravepy_int.cpp(1365) : error C3861:
'RavePrintfA_INFOLEVEL': identifier not found
9>..\..\..\python\bindings\openravepy_int.cpp(2841) : error C2039:
'RavePrintfA_INFOLEVEL' : is not a member of 'OpenRAVE'
9>..\..\..\python\bindings\openravepy_int.cpp(2841) : error C2039:
'RavePrintfA_INFOLEVEL' : is not a member of 'OpenRAVE'
9>..\..\..\python\bindings\openravepy_int.cpp(2841) : error C3861:
'RavePrintfA_INFOLEVEL': identifier not found
9>..\..\..\python\bindings\openravepy_int.cpp(2841) : error C3861:
'RavePrintfA_INFOLEVEL': identifier not found
9>Build log was saved at
"file://c:\_Users\Junggon\Works\Projects\toyota_manip\data\openrave_source\OpenRAVE_1725\build\python\bindings\openravepy_int.dir\Release\BuildLog.htm"
9>openravepy_int - 8 error(s), 4 warning(s)
========== Build: 0 succeeded, 9 failed, 31 up-to-date, 0 skipped ==========

------------------------------------------------------------------------------
Automate Storage Tiering Simply
Optimize IT performance and efficiency through flexible, powerful,
automated storage tiering capabilities. View this brief to learn how
you can reduce costs and improve performance.
http://p.sf.net/sfu/dell-sfdev2dev
_______________________________________________
Openrave-users mailing list
[hidden email]
https://lists.sourceforge.net/lists/listinfo/openrave-users
Reply | Threaded
Open this post in threaded view
|

Re: Compiling r1725 failed in Windows XP

Rosen Diankov
Administrator
Hi Junggon,

You are right, some of the print functions got updated in order to
take care of black text being outputted on black backgrounds.
Compilation should be fixed in r1726.

rosen,

2010/9/10 Junggon Kim <[hidden email]>:

> Hi Rosen,
>
> I'm trying to install OpenRAVE r1725, the latest version, in Windows
> XP, but I got the following error messages during ALL_BUILD. All the
> errors are about the log printing functions. Thanks.
>
> -Junggon
>
> ------
> 1>------ Build started: Project: qtcoinrave, Configuration: Release Win32 ------
> 2>------ Build started: Project: libopenrave-core, Configuration:
> Release Win32 ------
> 3>------ Build started: Project: ikfastsolvers, Configuration: Release
> Win32 ------
> 2>Compiling...
> 1>Compiling...
> 4>------ Build started: Project: dualmanipulation, Configuration:
> Release Win32 ------
> 3>Compiling...
> 4>Compiling...
> 1>cl : Command line warning D9025 : overriding '/EHc' with '/EHc-'
> 1>qtcoinviewer.cpp
> 2>cl : Command line warning D9025 : overriding '/EHc' with '/EHc-'
> 2>openrave-core.cpp
> 4>cl : Command line warning D9025 : overriding '/EHc' with '/EHc-'
> 4>dualmanipulation.cpp
> 3>cl : Command line warning D9025 : overriding '/EHc' with '/EHc-'
> 3>ikfastsolvers.cpp
> 2>using native typeof
> 4>using native typeof
> 3>using native typeof
> 1>using native typeof
> 3>c:\_users\junggon\works\projects\toyota_manip\data\openrave_source\openrave_1725\plugins\ikfastsolvers\ikfastproblem.h(47)
> : warning C4305: '-=' : truncation from 'double' to 'float'
> 3>c:\_users\junggon\works\projects\toyota_manip\data\openrave_source\openrave_1725\plugins\ikfastsolvers\ikfastproblem.h(49)
> : warning C4305: '+=' : truncation from 'double' to 'float'
> 4>c:\_users\junggon\works\projects\toyota_manip\data\openrave_source\openrave_1725\plugins\dualmanipulation\dualmanipulation.h(302)
> : error C2039: 'RavePrintfA_INFOLEVEL' : is not a member of 'OpenRAVE'
> 4>c:\_users\junggon\works\projects\toyota_manip\data\openrave_source\openrave_1725\plugins\dualmanipulation\dualmanipulation.h(302)
> : error C2039: 'RavePrintfA_INFOLEVEL' : is not a member of 'OpenRAVE'
> 4>c:\_users\junggon\works\projects\toyota_manip\data\openrave_source\openrave_1725\plugins\dualmanipulation\dualmanipulation.h(302)
> : error C3861: 'RavePrintfA_INFOLEVEL': identifier not found
> 4>c:\_users\junggon\works\projects\toyota_manip\data\openrave_source\openrave_1725\plugins\dualmanipulation\dualmanipulation.h(302)
> : error C3861: 'RavePrintfA_INFOLEVEL': identifier not found
> 4>c:\_users\junggon\works\projects\toyota_manip\data\openrave_source\openrave_1725\plugins\dualmanipulation\dualmanipulation.h(308)
> : error C2039: 'RavePrintfA_INFOLEVEL' : is not a member of 'OpenRAVE'
> 4>c:\_users\junggon\works\projects\toyota_manip\data\openrave_source\openrave_1725\plugins\dualmanipulation\dualmanipulation.h(308)
> : error C2039: 'RavePrintfA_INFOLEVEL' : is not a member of 'OpenRAVE'
> 4>c:\_users\junggon\works\projects\toyota_manip\data\openrave_source\openrave_1725\plugins\dualmanipulation\dualmanipulation.h(308)
> : error C3861: 'RavePrintfA_INFOLEVEL': identifier not found
> 4>c:\_users\junggon\works\projects\toyota_manip\data\openrave_source\openrave_1725\plugins\dualmanipulation\dualmanipulation.h(308)
> : error C3861: 'RavePrintfA_INFOLEVEL': identifier not found
> 4>c:\_users\junggon\works\projects\toyota_manip\data\openrave_source\openrave_1725\plugins\dualmanipulation\dualmanipulation.h(454)
> : warning C4244: 'argument' : conversion from 'double' to 'float',
> possible loss of data
> 4>Build log was saved at
> "file://c:\_Users\Junggon\Works\Projects\toyota_manip\data\openrave_source\OpenRAVE_1725\build\plugins\dualmanipulation\dualmanipulation.dir\Release\BuildLog.htm"
> 4>dualmanipulation - 8 error(s), 2 warning(s)
> 3>c:\_users\junggon\works\projects\toyota_manip\data\openrave_source\openrave_1725\plugins\ikfastsolvers\ikfastproblem.h(871)
> : warning C4244: 'argument' : conversion from 'double' to 'float',
> possible loss of data
> 3>c:\_users\junggon\works\projects\toyota_manip\data\openrave_source\openrave_1725\plugins\ikfastsolvers\ikfastproblem.h(925)
> : error C2039: 'RavePrintfA_INFOLEVEL' : is not a member of 'OpenRAVE'
> 3>c:\_users\junggon\works\projects\toyota_manip\data\openrave_source\openrave_1725\plugins\ikfastsolvers\ikfastproblem.h(925)
> : error C2039: 'RavePrintfA_INFOLEVEL' : is not a member of 'OpenRAVE'
> 3>c:\_users\junggon\works\projects\toyota_manip\data\openrave_source\openrave_1725\plugins\ikfastsolvers\ikfastproblem.h(925)
> : error C3861: 'RavePrintfA_INFOLEVEL': identifier not found
> 3>c:\_users\junggon\works\projects\toyota_manip\data\openrave_source\openrave_1725\plugins\ikfastsolvers\ikfastproblem.h(925)
> : error C3861: 'RavePrintfA_INFOLEVEL': identifier not found
> 3>c:\_users\junggon\works\projects\toyota_manip\data\openrave_source\openrave_1725\plugins\ikfastsolvers\ik_barrettwam.h(87)
> : warning C4305: 'return' : truncation from 'double' to 'float'
> 3>c:\_users\junggon\works\projects\toyota_manip\data\openrave_source\openrave_1725\plugins\ikfastsolvers\ik_barrettwam.h(88)
> : warning C4305: 'return' : truncation from 'double' to 'float'
> 3>c:\_users\junggon\works\projects\toyota_manip\data\openrave_source\openrave_1725\plugins\ikfastsolvers\ik_barrettwam.h(102)
> : warning C4305: 'return' : truncation from 'double' to 'float'
> 3>c:\_users\junggon\works\projects\toyota_manip\data\openrave_source\openrave_1725\plugins\ikfastsolvers\ik_barrettwam.h(122)
> : warning C4305: 'return' : truncation from 'double' to 'float'
> 3>c:\_users\junggon\works\projects\toyota_manip\data\openrave_source\openrave_1725\plugins\ikfastsolvers\ik_pa10.h(87)
> : warning C4305: 'return' : truncation from 'double' to 'float'
> 3>c:\_users\junggon\works\projects\toyota_manip\data\openrave_source\openrave_1725\plugins\ikfastsolvers\ik_pa10.h(88)
> : warning C4305: 'return' : truncation from 'double' to 'float'
> 3>c:\_users\junggon\works\projects\toyota_manip\data\openrave_source\openrave_1725\plugins\ikfastsolvers\ik_pa10.h(102)
> : warning C4305: 'return' : truncation from 'double' to 'float'
> 3>c:\_users\junggon\works\projects\toyota_manip\data\openrave_source\openrave_1725\plugins\ikfastsolvers\ik_pa10.h(122)
> : warning C4305: 'return' : truncation from 'double' to 'float'
> 3>c:\_users\junggon\works\projects\toyota_manip\data\openrave_source\openrave_1725\plugins\ikfastsolvers\ik_puma.h(87)
> : warning C4305: 'return' : truncation from 'double' to 'float'
> 3>c:\_users\junggon\works\projects\toyota_manip\data\openrave_source\openrave_1725\plugins\ikfastsolvers\ik_puma.h(88)
> : warning C4305: 'return' : truncation from 'double' to 'float'
> 3>c:\_users\junggon\works\projects\toyota_manip\data\openrave_source\openrave_1725\plugins\ikfastsolvers\ik_puma.h(102)
> : warning C4305: 'return' : truncation from 'double' to 'float'
> 3>c:\_users\junggon\works\projects\toyota_manip\data\openrave_source\openrave_1725\plugins\ikfastsolvers\ik_puma.h(122)
> : warning C4305: 'return' : truncation from 'double' to 'float'
> 3>c:\_users\junggon\works\projects\toyota_manip\data\openrave_source\openrave_1725\plugins\ikfastsolvers\ik_manusleftarm.h(87)
> : warning C4305: 'return' : truncation from 'double' to 'float'
> 3>c:\_users\junggon\works\projects\toyota_manip\data\openrave_source\openrave_1725\plugins\ikfastsolvers\ik_manusleftarm.h(88)
> : warning C4305: 'return' : truncation from 'double' to 'float'
> 3>c:\_users\junggon\works\projects\toyota_manip\data\openrave_source\openrave_1725\plugins\ikfastsolvers\ik_manusleftarm.h(102)
> : warning C4305: 'return' : truncation from 'double' to 'float'
> 3>c:\_users\junggon\works\projects\toyota_manip\data\openrave_source\openrave_1725\plugins\ikfastsolvers\ik_manusleftarm.h(122)
> : warning C4305: 'return' : truncation from 'double' to 'float'
> 3>c:\_users\junggon\works\projects\toyota_manip\data\openrave_source\openrave_1725\plugins\ikfastsolvers\ik_man1left.h(87)
> : warning C4305: 'return' : truncation from 'double' to 'float'
> 3>c:\_users\junggon\works\projects\toyota_manip\data\openrave_source\openrave_1725\plugins\ikfastsolvers\ik_man1left.h(88)
> : warning C4305: 'return' : truncation from 'double' to 'float'
> 3>c:\_users\junggon\works\projects\toyota_manip\data\openrave_source\openrave_1725\plugins\ikfastsolvers\ik_man1left.h(102)
> : warning C4305: 'return' : truncation from 'double' to 'float'
> 3>c:\_users\junggon\works\projects\toyota_manip\data\openrave_source\openrave_1725\plugins\ikfastsolvers\ik_man1left.h(122)
> : warning C4305: 'return' : truncation from 'double' to 'float'
> 3>c:\_users\junggon\works\projects\toyota_manip\data\openrave_source\openrave_1725\plugins\ikfastsolvers\ik_man1right.h(87)
> : warning C4305: 'return' : truncation from 'double' to 'float'
> 3>c:\_users\junggon\works\projects\toyota_manip\data\openrave_source\openrave_1725\plugins\ikfastsolvers\ik_man1right.h(88)
> : warning C4305: 'return' : truncation from 'double' to 'float'
> 3>c:\_users\junggon\works\projects\toyota_manip\data\openrave_source\openrave_1725\plugins\ikfastsolvers\ik_man1right.h(102)
> : warning C4305: 'return' : truncation from 'double' to 'float'
> 3>c:\_users\junggon\works\projects\toyota_manip\data\openrave_source\openrave_1725\plugins\ikfastsolvers\ik_man1right.h(122)
> : warning C4305: 'return' : truncation from 'double' to 'float'
> 3>c:\_users\junggon\works\projects\toyota_manip\data\openrave_source\openrave_1725\plugins\ikfastsolvers\ik_katana.h(87)
> : warning C4305: 'return' : truncation from 'double' to 'float'
> 3>c:\_users\junggon\works\projects\toyota_manip\data\openrave_source\openrave_1725\plugins\ikfastsolvers\ik_katana.h(88)
> : warning C4305: 'return' : truncation from 'double' to 'float'
> 3>c:\_users\junggon\works\projects\toyota_manip\data\openrave_source\openrave_1725\plugins\ikfastsolvers\ik_katana.h(102)
> : warning C4305: 'return' : truncation from 'double' to 'float'
> 2>c:\_users\junggon\works\projects\toyota_manip\data\openrave_source\openrave_1725\src\libopenrave-core\xmlreaders.h(599)
> : warning C4996: 'stricmp': The POSIX name for this item is
> deprecated. Instead, use the ISO C++ conformant name: _stricmp. See
> online help for details.
> 3>c:\_users\junggon\works\projects\toyota_manip\data\openrave_source\openrave_1725\plugins\ikfastsolvers\ik_katana.h(122)
> : warning C4305: 'return' : truncation from 'double' to 'float'
> 2>        C:\Program Files\Microsoft Visual Studio
> 9.0\VC\include\string.h(215) : see declaration of 'stricmp'
> 3>Build log was saved at
> "file://c:\_Users\Junggon\Works\Projects\toyota_manip\data\openrave_source\OpenRAVE_1725\build\plugins\ikfastsolvers\ikfastsolvers.dir\Release\BuildLog.htm"
> 3>ikfastsolvers - 4 error(s), 32 warning(s)
> 2>c:\_users\junggon\works\projects\toyota_manip\data\openrave_source\openrave_1725\src\libopenrave-core\xmlreaders.h(664)
> : warning C4996: 'stricmp': The POSIX name for this item is
> deprecated. Instead, use the ISO C++ conformant name: _stricmp. See
> online help for details.
> 2>        C:\Program Files\Microsoft Visual Studio
> 9.0\VC\include\string.h(215) : see declaration of 'stricmp'
> 5>------ Build started: Project: rplanners, Configuration: Release Win32 ------
> 2>c:\_users\junggon\works\projects\toyota_manip\data\openrave_source\openrave_1725\src\libopenrave-core\xmlreaders.h(667)
> : warning C4996: 'stricmp': The POSIX name for this item is
> deprecated. Instead, use the ISO C++ conformant name: _stricmp. See
> online help for details.
> 2>        C:\Program Files\Microsoft Visual Studio
> 9.0\VC\include\string.h(215) : see declaration of 'stricmp'
> 2>c:\_users\junggon\works\projects\toyota_manip\data\openrave_source\openrave_1725\src\libopenrave-core\xmlreaders.h(671)
> : error C2039: 'RavePrintfA_INFOLEVEL' : is not a member of 'OpenRAVE'
> 5>Compiling...
> 2>c:\_users\junggon\works\projects\toyota_manip\data\openrave_source\openrave_1725\src\libopenrave-core\xmlreaders.h(671)
> : error C2039: 'RavePrintfA_INFOLEVEL' : is not a member of 'OpenRAVE'
> 2>c:\_users\junggon\works\projects\toyota_manip\data\openrave_source\openrave_1725\src\libopenrave-core\xmlreaders.h(671)
> : error C3861: 'RavePrintfA_INFOLEVEL': identifier not found
> 2>c:\_users\junggon\works\projects\toyota_manip\data\openrave_source\openrave_1725\src\libopenrave-core\xmlreaders.h(671)
> : error C3861: 'RavePrintfA_INFOLEVEL': identifier not found
> 2>c:\_users\junggon\works\projects\toyota_manip\data\openrave_source\openrave_1725\src\libopenrave-core\xmlreaders.h(1590)
> : error C2039: 'RavePrintfA_INFOLEVEL' : is not a member of 'OpenRAVE'
> 2>c:\_users\junggon\works\projects\toyota_manip\data\openrave_source\openrave_1725\src\libopenrave-core\xmlreaders.h(1590)
> : error C2039: 'RavePrintfA_INFOLEVEL' : is not a member of 'OpenRAVE'
> 2>c:\_users\junggon\works\projects\toyota_manip\data\openrave_source\openrave_1725\src\libopenrave-core\xmlreaders.h(1590)
> : error C3861: 'RavePrintfA_INFOLEVEL': identifier not found
> 2>c:\_users\junggon\works\projects\toyota_manip\data\openrave_source\openrave_1725\src\libopenrave-core\xmlreaders.h(1590)
> : error C3861: 'RavePrintfA_INFOLEVEL': identifier not found
> 2>c:\_users\junggon\works\projects\toyota_manip\data\openrave_source\openrave_1725\src\libopenrave-core\xmlreaders.h(1815)
> : error C2039: 'RavePrintfA_INFOLEVEL' : is not a member of 'OpenRAVE'
> 2>c:\_users\junggon\works\projects\toyota_manip\data\openrave_source\openrave_1725\src\libopenrave-core\xmlreaders.h(1815)
> : error C2039: 'RavePrintfA_INFOLEVEL' : is not a member of 'OpenRAVE'
> 2>c:\_users\junggon\works\projects\toyota_manip\data\openrave_source\openrave_1725\src\libopenrave-core\xmlreaders.h(1815)
> : error C3861: 'RavePrintfA_INFOLEVEL': identifier not found
> 2>c:\_users\junggon\works\projects\toyota_manip\data\openrave_source\openrave_1725\src\libopenrave-core\xmlreaders.h(1815)
> : error C3861: 'RavePrintfA_INFOLEVEL': identifier not found
> 2>c:\_users\junggon\works\projects\toyota_manip\data\openrave_source\openrave_1725\src\libopenrave-core\xmlreaders.h(2316)
> : error C2039: 'RavePrintfA_INFOLEVEL' : is not a member of 'OpenRAVE'
> 2>c:\_users\junggon\works\projects\toyota_manip\data\openrave_source\openrave_1725\src\libopenrave-core\xmlreaders.h(2316)
> : error C2039: 'RavePrintfA_INFOLEVEL' : is not a member of 'OpenRAVE'
> 2>c:\_users\junggon\works\projects\toyota_manip\data\openrave_source\openrave_1725\src\libopenrave-core\xmlreaders.h(2316)
> : error C3861: 'RavePrintfA_INFOLEVEL': identifier not found
> 2>c:\_users\junggon\works\projects\toyota_manip\data\openrave_source\openrave_1725\src\libopenrave-core\xmlreaders.h(2316)
> : error C3861: 'RavePrintfA_INFOLEVEL': identifier not found
> 2>c:\_users\junggon\works\projects\toyota_manip\data\openrave_source\openrave_1725\src\libopenrave-core\xmlreaders.h(2318)
> : error C2039: 'RavePrintfA_INFOLEVEL' : is not a member of 'OpenRAVE'
> 2>c:\_users\junggon\works\projects\toyota_manip\data\openrave_source\openrave_1725\src\libopenrave-core\xmlreaders.h(2318)
> : error C2039: 'RavePrintfA_INFOLEVEL' : is not a member of 'OpenRAVE'
> 2>c:\_users\junggon\works\projects\toyota_manip\data\openrave_source\openrave_1725\src\libopenrave-core\xmlreaders.h(2318)
> : error C3861: 'RavePrintfA_INFOLEVEL': identifier not found
> 2>c:\_users\junggon\works\projects\toyota_manip\data\openrave_source\openrave_1725\src\libopenrave-core\xmlreaders.h(2318)
> : error C3861: 'RavePrintfA_INFOLEVEL': identifier not found
> 5>cl : Command line warning D9025 : overriding '/EHc' with '/EHc-'
> 5>rplanners.cpp
> 2>c:\_users\junggon\works\projects\toyota_manip\data\openrave_source\openrave_1725\src\libopenrave-core\environment.h(1147)
> : error C2039: 'RavePrintfA_INFOLEVEL' : is not a member of 'OpenRAVE'
> 2>c:\_users\junggon\works\projects\toyota_manip\data\openrave_source\openrave_1725\src\libopenrave-core\environment.h(1147)
> : error C2039: 'RavePrintfA_INFOLEVEL' : is not a member of 'OpenRAVE'
> 2>c:\_users\junggon\works\projects\toyota_manip\data\openrave_source\openrave_1725\src\libopenrave-core\environment.h(1147)
> : error C3861: 'RavePrintfA_INFOLEVEL': identifier not found
> 2>c:\_users\junggon\works\projects\toyota_manip\data\openrave_source\openrave_1725\src\libopenrave-core\environment.h(1147)
> : error C3861: 'RavePrintfA_INFOLEVEL': identifier not found
> 6>------ Build started: Project: textserver, Configuration: Release Win32 ------
> 6>Compiling...
> 6>cl : Command line warning D9025 : overriding '/EHc' with '/EHc-'
> 6>textserver.cpp
> 1>..\..\..\plugins\qtcoinrave\qtcoinviewer.cpp(236) : error C2039:
> 'RavePrintfA_INFOLEVEL' : is not a member of 'OpenRAVE'
> 1>..\..\..\plugins\qtcoinrave\qtcoinviewer.cpp(236) : error C2039:
> 'RavePrintfA_INFOLEVEL' : is not a member of 'OpenRAVE'
> 1>..\..\..\plugins\qtcoinrave\qtcoinviewer.cpp(236) : error C3861:
> 'RavePrintfA_INFOLEVEL': identifier not found
> 1>..\..\..\plugins\qtcoinrave\qtcoinviewer.cpp(236) : error C3861:
> 'RavePrintfA_INFOLEVEL': identifier not found
> 1>..\..\..\plugins\qtcoinrave\qtcoinviewer.cpp(1042) : error C2039:
> 'RavePrintfA_INFOLEVEL' : is not a member of 'OpenRAVE'
> 1>..\..\..\plugins\qtcoinrave\qtcoinviewer.cpp(1042) : error C2039:
> 'RavePrintfA_INFOLEVEL' : is not a member of 'OpenRAVE'
> 1>..\..\..\plugins\qtcoinrave\qtcoinviewer.cpp(1042) : error C3861:
> 'RavePrintfA_INFOLEVEL': identifier not found
> 1>..\..\..\plugins\qtcoinrave\qtcoinviewer.cpp(1042) : error C3861:
> 'RavePrintfA_INFOLEVEL': identifier not found
> 1>..\..\..\plugins\qtcoinrave\qtcoinviewer.cpp(2669) : error C2039:
> 'RavePrintfA_INFOLEVEL' : is not a member of 'OpenRAVE'
> 1>..\..\..\plugins\qtcoinrave\qtcoinviewer.cpp(2669) : error C2039:
> 'RavePrintfA_INFOLEVEL' : is not a member of 'OpenRAVE'
> 1>..\..\..\plugins\qtcoinrave\qtcoinviewer.cpp(2669) : error C3861:
> 'RavePrintfA_INFOLEVEL': identifier not found
> 1>..\..\..\plugins\qtcoinrave\qtcoinviewer.cpp(2669) : error C3861:
> 'RavePrintfA_INFOLEVEL': identifier not found
> 1>..\..\..\plugins\qtcoinrave\qtcoinviewer.cpp(2817) : error C2039:
> 'RavePrintfA_INFOLEVEL' : is not a member of 'OpenRAVE'
> 1>..\..\..\plugins\qtcoinrave\qtcoinviewer.cpp(2817) : error C2039:
> 'RavePrintfA_INFOLEVEL' : is not a member of 'OpenRAVE'
> 1>..\..\..\plugins\qtcoinrave\qtcoinviewer.cpp(2817) : error C3861:
> 'RavePrintfA_INFOLEVEL': identifier not found
> 1>..\..\..\plugins\qtcoinrave\qtcoinviewer.cpp(2817) : error C3861:
> 'RavePrintfA_INFOLEVEL': identifier not found
> 5>using native typeof
> 6>using native typeof
> 5>c:\_users\junggon\works\projects\toyota_manip\data\openrave_source\openrave_1725\plugins\rplanners\graspgradient.h(255)
> : error C2039: 'RavePrintfA_INFOLEVEL' : is not a member of 'OpenRAVE'
> 5>c:\_users\junggon\works\projects\toyota_manip\data\openrave_source\openrave_1725\plugins\rplanners\graspgradient.h(255)
> : error C2039: 'RavePrintfA_INFOLEVEL' : is not a member of 'OpenRAVE'
> 5>c:\_users\junggon\works\projects\toyota_manip\data\openrave_source\openrave_1725\plugins\rplanners\graspgradient.h(255)
> : error C3861: 'RavePrintfA_INFOLEVEL': identifier not found
> 5>c:\_users\junggon\works\projects\toyota_manip\data\openrave_source\openrave_1725\plugins\rplanners\graspgradient.h(255)
> : error C3861: 'RavePrintfA_INFOLEVEL': identifier not found
> 5>c:\_users\junggon\works\projects\toyota_manip\data\openrave_source\openrave_1725\plugins\rplanners\graspgradient.h(336)
> : error C2039: 'RavePrintfA_INFOLEVEL' : is not a member of 'OpenRAVE'
> 5>c:\_users\junggon\works\projects\toyota_manip\data\openrave_source\openrave_1725\plugins\rplanners\graspgradient.h(336)
> : error C2039: 'RavePrintfA_INFOLEVEL' : is not a member of 'OpenRAVE'
> 5>c:\_users\junggon\works\projects\toyota_manip\data\openrave_source\openrave_1725\plugins\rplanners\graspgradient.h(336)
> : error C3861: 'RavePrintfA_INFOLEVEL': identifier not found
> 5>c:\_users\junggon\works\projects\toyota_manip\data\openrave_source\openrave_1725\plugins\rplanners\graspgradient.h(336)
> : error C3861: 'RavePrintfA_INFOLEVEL': identifier not found
> 5>Build log was saved at
> "file://c:\_Users\Junggon\Works\Projects\toyota_manip\data\openrave_source\OpenRAVE_1725\build\plugins\rplanners\rplanners.dir\Release\BuildLog.htm"
> 5>rplanners - 8 error(s), 1 warning(s)
> 2>c:\_users\junggon\works\projects\toyota_manip\data\openrave_source\openrave_1725\src\libopenrave-core\colladareader.h(750)
> : error C2039: 'RavePrintfA_INFOLEVEL' : is not a member of 'OpenRAVE'
> 2>c:\_users\junggon\works\projects\toyota_manip\data\openrave_source\openrave_1725\src\libopenrave-core\colladareader.h(750)
> : error C2039: 'RavePrintfA_INFOLEVEL' : is not a member of 'OpenRAVE'
> 2>c:\_users\junggon\works\projects\toyota_manip\data\openrave_source\openrave_1725\src\libopenrave-core\colladareader.h(750)
> : error C3861: 'RavePrintfA_INFOLEVEL': identifier not found
> 2>c:\_users\junggon\works\projects\toyota_manip\data\openrave_source\openrave_1725\src\libopenrave-core\colladareader.h(750)
> : error C3861: 'RavePrintfA_INFOLEVEL': identifier not found
> 2>c:\_users\junggon\works\projects\toyota_manip\data\openrave_source\openrave_1725\src\libopenrave-core\colladareader.h(1129)
> : error C2039: 'RavePrintfA_INFOLEVEL' : is not a member of 'OpenRAVE'
> 2>c:\_users\junggon\works\projects\toyota_manip\data\openrave_source\openrave_1725\src\libopenrave-core\colladareader.h(1129)
> : error C2039: 'RavePrintfA_INFOLEVEL' : is not a member of 'OpenRAVE'
> 2>c:\_users\junggon\works\projects\toyota_manip\data\openrave_source\openrave_1725\src\libopenrave-core\colladareader.h(1129)
> : error C3861: 'RavePrintfA_INFOLEVEL': identifier not found
> 2>c:\_users\junggon\works\projects\toyota_manip\data\openrave_source\openrave_1725\src\libopenrave-core\colladareader.h(1129)
> : error C3861: 'RavePrintfA_INFOLEVEL': identifier not found
> 2>c:\_users\junggon\works\projects\toyota_manip\data\openrave_source\openrave_1725\src\libopenrave-core\colladareader.h(1424)
> : error C2039: 'RavePrintfA_INFOLEVEL' : is not a member of 'OpenRAVE'
> 2>c:\_users\junggon\works\projects\toyota_manip\data\openrave_source\openrave_1725\src\libopenrave-core\colladareader.h(1424)
> : error C2039: 'RavePrintfA_INFOLEVEL' : is not a member of 'OpenRAVE'
> 2>c:\_users\junggon\works\projects\toyota_manip\data\openrave_source\openrave_1725\src\libopenrave-core\colladareader.h(1424)
> : error C3861: 'RavePrintfA_INFOLEVEL': identifier not found
> 2>c:\_users\junggon\works\projects\toyota_manip\data\openrave_source\openrave_1725\src\libopenrave-core\colladareader.h(1424)
> : error C3861: 'RavePrintfA_INFOLEVEL': identifier not found
> 2>c:\_users\junggon\works\projects\toyota_manip\data\openrave_source\openrave_1725\src\libopenrave-core\colladareader.h(1436)
> : error C2039: 'RavePrintfA_INFOLEVEL' : is not a member of 'OpenRAVE'
> 2>c:\_users\junggon\works\projects\toyota_manip\data\openrave_source\openrave_1725\src\libopenrave-core\colladareader.h(1436)
> : error C2039: 'RavePrintfA_INFOLEVEL' : is not a member of 'OpenRAVE'
> 2>c:\_users\junggon\works\projects\toyota_manip\data\openrave_source\openrave_1725\src\libopenrave-core\colladareader.h(1436)
> : error C3861: 'RavePrintfA_INFOLEVEL': identifier not found
> 2>c:\_users\junggon\works\projects\toyota_manip\data\openrave_source\openrave_1725\src\libopenrave-core\colladareader.h(1436)
> : error C3861: 'RavePrintfA_INFOLEVEL': identifier not found
> 2>c:\_users\junggon\works\projects\toyota_manip\data\openrave_source\openrave_1725\src\libopenrave-core\colladareader.h(1696)
> : error C2039: 'RavePrintfA_INFOLEVEL' : is not a member of 'OpenRAVE'
> 2>c:\_users\junggon\works\projects\toyota_manip\data\openrave_source\openrave_1725\src\libopenrave-core\colladareader.h(1696)
> : error C2039: 'RavePrintfA_INFOLEVEL' : is not a member of 'OpenRAVE'
> 2>c:\_users\junggon\works\projects\toyota_manip\data\openrave_source\openrave_1725\src\libopenrave-core\colladareader.h(1696)
> : error C3861: 'RavePrintfA_INFOLEVEL': identifier not found
> 6>c:\_users\junggon\works\projects\toyota_manip\data\openrave_source\openrave_1725\plugins\textserver\textserver.h(384)
> : error C2039: 'RavePrintfA_INFOLEVEL' : is not a member of 'OpenRAVE'
> 2>c:\_users\junggon\works\projects\toyota_manip\data\openrave_source\openrave_1725\src\libopenrave-core\colladareader.h(1696)
> : error C3861: 'RavePrintfA_INFOLEVEL': identifier not found
> 6>c:\_users\junggon\works\projects\toyota_manip\data\openrave_source\openrave_1725\plugins\textserver\textserver.h(384)
> : error C2039: 'RavePrintfA_INFOLEVEL' : is not a member of 'OpenRAVE'
> 2>c:\_users\junggon\works\projects\toyota_manip\data\openrave_source\openrave_1725\src\libopenrave-core\colladareader.h(1930)
> : warning C4244: 'initializing' : conversion from 'domUint' to 'int',
> possible loss of data
> 2>c:\_users\junggon\works\projects\toyota_manip\data\openrave_source\openrave_1725\src\libopenrave-core\colladareader.h(1964)
> : warning C4244: 'argument' : conversion from 'domUint' to 'unsigned
> int', possible loss of data
> 6>c:\_users\junggon\works\projects\toyota_manip\data\openrave_source\openrave_1725\plugins\textserver\textserver.h(384)
> : error C3861: 'RavePrintfA_INFOLEVEL': identifier not found
> 2>c:\_users\junggon\works\projects\toyota_manip\data\openrave_source\openrave_1725\src\libopenrave-core\colladareader.h(1966)
> : warning C4244: 'argument' : conversion from 'domUint' to 'unsigned
> int', possible loss of data
> 6>c:\_users\junggon\works\projects\toyota_manip\data\openrave_source\openrave_1725\plugins\textserver\textserver.h(384)
> : error C3861: 'RavePrintfA_INFOLEVEL': identifier not found
> 2>c:\_users\junggon\works\projects\toyota_manip\data\openrave_source\openrave_1725\src\libopenrave-core\colladareader.h(1971)
> : warning C4244: 'initializing' : conversion from 'const domUint' to
> 'int', possible loss of data
> 2>c:\_users\junggon\works\projects\toyota_manip\data\openrave_source\openrave_1725\src\libopenrave-core\colladareader.h(2029)
> : warning C4244: 'initializing' : conversion from 'domUint' to 'int',
> possible loss of data
> 2>c:\_users\junggon\works\projects\toyota_manip\data\openrave_source\openrave_1725\src\libopenrave-core\colladareader.h(2065)
> : warning C4244: 'argument' : conversion from 'domUint' to 'unsigned
> int', possible loss of data
> 2>c:\_users\junggon\works\projects\toyota_manip\data\openrave_source\openrave_1725\src\libopenrave-core\colladareader.h(2067)
> : warning C4244: 'argument' : conversion from 'domUint' to 'unsigned
> int', possible loss of data
> 2>c:\_users\junggon\works\projects\toyota_manip\data\openrave_source\openrave_1725\src\libopenrave-core\colladareader.h(2073)
> : warning C4244: 'initializing' : conversion from 'domUint' to 'int',
> possible loss of data
> 2>c:\_users\junggon\works\projects\toyota_manip\data\openrave_source\openrave_1725\src\libopenrave-core\colladareader.h(2122)
> : warning C4244: 'initializing' : conversion from 'domUint' to 'int',
> possible loss of data
> 2>c:\_users\junggon\works\projects\toyota_manip\data\openrave_source\openrave_1725\src\libopenrave-core\colladareader.h(2158)
> : warning C4244: 'argument' : conversion from 'domUint' to 'unsigned
> int', possible loss of data
> 2>c:\_users\junggon\works\projects\toyota_manip\data\openrave_source\openrave_1725\src\libopenrave-core\colladareader.h(2160)
> : warning C4244: 'argument' : conversion from 'domUint' to 'unsigned
> int', possible loss of data
> 2>c:\_users\junggon\works\projects\toyota_manip\data\openrave_source\openrave_1725\src\libopenrave-core\colladareader.h(2166)
> : warning C4244: 'initializing' : conversion from 'domUint' to 'int',
> possible loss of data
> 2>c:\_users\junggon\works\projects\toyota_manip\data\openrave_source\openrave_1725\src\libopenrave-core\colladareader.h(2310)
> : warning C4244: 'argument' : conversion from 'domUint' to 'unsigned
> int', possible loss of data
> 2>c:\_users\junggon\works\projects\toyota_manip\data\openrave_source\openrave_1725\src\libopenrave-core\colladareader.h(2345)
> : warning C4244: 'argument' : conversion from 'domUint' to 'unsigned
> int', possible loss of data
> 2>Build log was saved at
> "file://c:\_Users\Junggon\Works\Projects\toyota_manip\data\openrave_source\OpenRAVE_1725\build\src\libopenrave-core\libopenrave-core.dir\Release\BuildLog.htm"
> 1>Build log was saved at
> "file://c:\_Users\Junggon\Works\Projects\toyota_manip\data\openrave_source\OpenRAVE_1725\build\plugins\qtcoinrave\qtcoinrave.dir\Release\BuildLog.htm"
> 2>libopenrave-core - 44 error(s), 18 warning(s)
> 1>qtcoinrave - 16 error(s), 1 warning(s)
> 7>------ Build started: Project: rmanipulation, Configuration: Release
> Win32 ------
> 7>Compiling...
> 6>c:\_users\junggon\works\projects\toyota_manip\data\openrave_source\openrave_1725\plugins\textserver\textserver.h(1956)
> : warning C4244: 'argument' : conversion from 'OpenRAVE::dReal' to
> 'const float', possible loss of data
> 6>c:\_users\junggon\works\projects\toyota_manip\data\openrave_source\openrave_1725\plugins\textserver\textserver.h(1956)
> : warning C4244: 'argument' : conversion from 'OpenRAVE::dReal' to
> 'const float', possible loss of data
> 6>c:\_users\junggon\works\projects\toyota_manip\data\openrave_source\openrave_1725\plugins\textserver\textserver.h(1956)
> : warning C4244: 'argument' : conversion from 'OpenRAVE::dReal' to
> 'const float', possible loss of data
> 6>c:\_users\junggon\works\projects\toyota_manip\data\openrave_source\openrave_1725\plugins\textserver\textserver.h(1957)
> : warning C4244: 'argument' : conversion from 'OpenRAVE::dReal' to
> 'const float', possible loss of data
> 6>c:\_users\junggon\works\projects\toyota_manip\data\openrave_source\openrave_1725\plugins\textserver\textserver.h(1957)
> : warning C4244: 'argument' : conversion from 'OpenRAVE::dReal' to
> 'const float', possible loss of data
> 6>c:\_users\junggon\works\projects\toyota_manip\data\openrave_source\openrave_1725\plugins\textserver\textserver.h(1957)
> : warning C4244: 'argument' : conversion from 'OpenRAVE::dReal' to
> 'const float', possible loss of data
> 7>cl : Command line warning D9025 : overriding '/EHc' with '/EHc-'
> 6>Build log was saved at
> "file://c:\_Users\Junggon\Works\Projects\toyota_manip\data\openrave_source\OpenRAVE_1725\build\plugins\textserver\textserver.dir\Release\BuildLog.htm"
> 7>rmanipulation.cpp
> 6>textserver - 4 error(s), 7 warning(s)
> 8>------ Build started: Project: openrave, Configuration: Release Win32 ------
> 9>------ Build started: Project: openravepy_int, Configuration:
> Release Win32 ------
> 8>Compiling...
> 9>Compiling...
> 8>cl : Command line warning D9025 : overriding '/EHc' with '/EHc-'
> 8>openrave.cpp
> 9>cl : Command line warning D9025 : overriding '/EHc' with '/EHc-'
> 9>openravepy_int.cpp
> 7>using native typeof
> 8>..\..\src\openrave.cpp(94) : warning C4996: 'stricmp': The POSIX
> name for this item is deprecated. Instead, use the ISO C++ conformant
> name: _stricmp. See online help for details.
> 8>        C:\Program Files\Microsoft Visual Studio
> 9.0\VC\include\string.h(215) : see declaration of 'stricmp'
> 8>..\..\src\openrave.cpp(95) : error C2039: 'RavePrintfA_INFOLEVEL' :
> is not a member of 'OpenRAVE'
> 8>..\..\src\openrave.cpp(95) : error C2039: 'RavePrintfA_INFOLEVEL' :
> is not a member of 'OpenRAVE'
> 8>..\..\src\openrave.cpp(95) : error C3861: 'RavePrintfA_INFOLEVEL':
> identifier not found
> 8>..\..\src\openrave.cpp(95) : error C3861: 'RavePrintfA_INFOLEVEL':
> identifier not found
> 8>..\..\src\openrave.cpp(191) : error C2039: 'RavePrintfA_INFOLEVEL' :
> is not a member of 'OpenRAVE'
> 8>..\..\src\openrave.cpp(191) : error C2039: 'RavePrintfA_INFOLEVEL' :
> is not a member of 'OpenRAVE'
> 8>..\..\src\openrave.cpp(191) : error C3861: 'RavePrintfA_INFOLEVEL':
> identifier not found
> 8>..\..\src\openrave.cpp(191) : error C3861: 'RavePrintfA_INFOLEVEL':
> identifier not found
> 8>Build log was saved at
> "file://c:\_Users\Junggon\Works\Projects\toyota_manip\data\openrave_source\OpenRAVE_1725\build\src\openrave.dir\Release\BuildLog.htm"
> 8>openrave - 8 error(s), 2 warning(s)
> 7>c:\_users\junggon\works\projects\toyota_manip\data\openrave_source\openrave_1725\plugins\rmanipulation\basemanipulation.h(348)
> : warning C4996: 'std::copy': Function call with parameters that may
> be unsafe - this call relies on the caller to check that the passed
> values are correct. To disable this warning, use
> -D_SCL_SECURE_NO_WARNINGS. See documentation on how to use Visual C++
> 'Checked Iterators'
> 7>        C:\Program Files\Microsoft Visual Studio
> 9.0\VC\include\xutility(2550) : see declaration of 'std::copy'
> 7>c:\_users\junggon\works\projects\toyota_manip\data\openrave_source\openrave_1725\plugins\rmanipulation\basemanipulation.h(409)
> : warning C4244: 'argument' : conversion from 'double' to 'float',
> possible loss of data
> 7>c:\_users\junggon\works\projects\toyota_manip\data\openrave_source\openrave_1725\plugins\rmanipulation\basemanipulation.h(526)
> : error C2039: 'RavePrintfA_INFOLEVEL' : is not a member of 'OpenRAVE'
> 7>c:\_users\junggon\works\projects\toyota_manip\data\openrave_source\openrave_1725\plugins\rmanipulation\basemanipulation.h(526)
> : error C2039: 'RavePrintfA_INFOLEVEL' : is not a member of 'OpenRAVE'
> 7>c:\_users\junggon\works\projects\toyota_manip\data\openrave_source\openrave_1725\plugins\rmanipulation\basemanipulation.h(526)
> : error C3861: 'RavePrintfA_INFOLEVEL': identifier not found
> 7>c:\_users\junggon\works\projects\toyota_manip\data\openrave_source\openrave_1725\plugins\rmanipulation\basemanipulation.h(526)
> : error C3861: 'RavePrintfA_INFOLEVEL': identifier not found
> 7>c:\_users\junggon\works\projects\toyota_manip\data\openrave_source\openrave_1725\plugins\rmanipulation\basemanipulation.h(536)
> : error C2039: 'RavePrintfA_INFOLEVEL' : is not a member of 'OpenRAVE'
> 7>c:\_users\junggon\works\projects\toyota_manip\data\openrave_source\openrave_1725\plugins\rmanipulation\basemanipulation.h(536)
> : error C2039: 'RavePrintfA_INFOLEVEL' : is not a member of 'OpenRAVE'
> 7>c:\_users\junggon\works\projects\toyota_manip\data\openrave_source\openrave_1725\plugins\rmanipulation\basemanipulation.h(536)
> : error C3861: 'RavePrintfA_INFOLEVEL': identifier not found
> 7>c:\_users\junggon\works\projects\toyota_manip\data\openrave_source\openrave_1725\plugins\rmanipulation\basemanipulation.h(536)
> : error C3861: 'RavePrintfA_INFOLEVEL': identifier not found
> 7>c:\_users\junggon\works\projects\toyota_manip\data\openrave_source\openrave_1725\plugins\rmanipulation\basemanipulation.h(797)
> : error C2039: 'RavePrintfA_INFOLEVEL' : is not a member of 'OpenRAVE'
> 7>c:\_users\junggon\works\projects\toyota_manip\data\openrave_source\openrave_1725\plugins\rmanipulation\basemanipulation.h(797)
> : error C2039: 'RavePrintfA_INFOLEVEL' : is not a member of 'OpenRAVE'
> 7>c:\_users\junggon\works\projects\toyota_manip\data\openrave_source\openrave_1725\plugins\rmanipulation\basemanipulation.h(797)
> : error C3861: 'RavePrintfA_INFOLEVEL': identifier not found
> 7>c:\_users\junggon\works\projects\toyota_manip\data\openrave_source\openrave_1725\plugins\rmanipulation\basemanipulation.h(797)
> : error C3861: 'RavePrintfA_INFOLEVEL': identifier not found
> 7>c:\_users\junggon\works\projects\toyota_manip\data\openrave_source\openrave_1725\plugins\rmanipulation\basemanipulation.h(853)
> : error C2039: 'RavePrintfA_INFOLEVEL' : is not a member of 'OpenRAVE'
> 7>c:\_users\junggon\works\projects\toyota_manip\data\openrave_source\openrave_1725\plugins\rmanipulation\basemanipulation.h(853)
> : error C2039: 'RavePrintfA_INFOLEVEL' : is not a member of 'OpenRAVE'
> 7>c:\_users\junggon\works\projects\toyota_manip\data\openrave_source\openrave_1725\plugins\rmanipulation\basemanipulation.h(853)
> : error C3861: 'RavePrintfA_INFOLEVEL': identifier not found
> 7>c:\_users\junggon\works\projects\toyota_manip\data\openrave_source\openrave_1725\plugins\rmanipulation\basemanipulation.h(853)
> : error C3861: 'RavePrintfA_INFOLEVEL': identifier not found
> 7>c:\_users\junggon\works\projects\toyota_manip\data\openrave_source\openrave_1725\plugins\rmanipulation\basemanipulation.h(863)
> : error C2039: 'RavePrintfA_INFOLEVEL' : is not a member of 'OpenRAVE'
> 7>c:\_users\junggon\works\projects\toyota_manip\data\openrave_source\openrave_1725\plugins\rmanipulation\basemanipulation.h(863)
> : error C2039: 'RavePrintfA_INFOLEVEL' : is not a member of 'OpenRAVE'
> 7>c:\_users\junggon\works\projects\toyota_manip\data\openrave_source\openrave_1725\plugins\rmanipulation\basemanipulation.h(863)
> : error C3861: 'RavePrintfA_INFOLEVEL': identifier not found
> 7>c:\_users\junggon\works\projects\toyota_manip\data\openrave_source\openrave_1725\plugins\rmanipulation\basemanipulation.h(863)
> : error C3861: 'RavePrintfA_INFOLEVEL': identifier not found
> 7>c:\_users\junggon\works\projects\toyota_manip\data\openrave_source\openrave_1725\plugins\rmanipulation\taskmanipulation.h(378)
> : error C2039: 'RavePrintfA_INFOLEVEL' : is not a member of 'OpenRAVE'
> 7>c:\_users\junggon\works\projects\toyota_manip\data\openrave_source\openrave_1725\plugins\rmanipulation\taskmanipulation.h(378)
> : error C2039: 'RavePrintfA_INFOLEVEL' : is not a member of 'OpenRAVE'
> 7>c:\_users\junggon\works\projects\toyota_manip\data\openrave_source\openrave_1725\plugins\rmanipulation\taskmanipulation.h(378)
> : error C3861: 'RavePrintfA_INFOLEVEL': identifier not found
> 7>c:\_users\junggon\works\projects\toyota_manip\data\openrave_source\openrave_1725\plugins\rmanipulation\taskmanipulation.h(378)
> : error C3861: 'RavePrintfA_INFOLEVEL': identifier not found
> 7>c:\_users\junggon\works\projects\toyota_manip\data\openrave_source\openrave_1725\plugins\rmanipulation\taskmanipulation.h(1371)
> : error C2039: 'RavePrintfA_INFOLEVEL' : is not a member of 'OpenRAVE'
> 7>c:\_users\junggon\works\projects\toyota_manip\data\openrave_source\openrave_1725\plugins\rmanipulation\taskmanipulation.h(1371)
> : error C2039: 'RavePrintfA_INFOLEVEL' : is not a member of 'OpenRAVE'
> 7>c:\_users\junggon\works\projects\toyota_manip\data\openrave_source\openrave_1725\plugins\rmanipulation\taskmanipulation.h(1371)
> : error C3861: 'RavePrintfA_INFOLEVEL': identifier not found
> 7>c:\_users\junggon\works\projects\toyota_manip\data\openrave_source\openrave_1725\plugins\rmanipulation\taskmanipulation.h(1371)
> : error C3861: 'RavePrintfA_INFOLEVEL': identifier not found
> 7>c:\_users\junggon\works\projects\toyota_manip\data\openrave_source\openrave_1725\plugins\rmanipulation\taskmanipulation.h(1410)
> : warning C4244: 'argument' : conversion from 'double' to 'float',
> possible loss of data
> 7>c:\_users\junggon\works\projects\toyota_manip\data\openrave_source\openrave_1725\plugins\rmanipulation\taskcaging.h(228)
> : warning C4244: 'argument' : conversion from 'OpenRAVE::dReal' to
> 'float', possible loss of data
> 7>c:\_users\junggon\works\projects\toyota_manip\data\openrave_source\openrave_1725\plugins\rmanipulation\taskcaging.h(228)
> : warning C4244: 'argument' : conversion from 'OpenRAVE::dReal' to
> 'float', possible loss of data
> 7>c:\_users\junggon\works\projects\toyota_manip\data\openrave_source\openrave_1725\plugins\rmanipulation\taskcaging.h(228)
> : warning C4244: 'argument' : conversion from 'OpenRAVE::dReal' to
> 'float', possible loss of data
> 7>c:\_users\junggon\works\projects\toyota_manip\data\openrave_source\openrave_1725\plugins\rmanipulation\taskcaging.h(252)
> : warning C4244: 'return' : conversion from 'double' to 'float',
> possible loss of data
> 7>c:\_users\junggon\works\projects\toyota_manip\data\openrave_source\openrave_1725\plugins\rmanipulation\taskcaging.h(923)
> : error C2039: 'RavePrintfA_INFOLEVEL' : is not a member of 'OpenRAVE'
> 7>c:\_users\junggon\works\projects\toyota_manip\data\openrave_source\openrave_1725\plugins\rmanipulation\taskcaging.h(923)
> : error C2039: 'RavePrintfA_INFOLEVEL' : is not a member of 'OpenRAVE'
> 7>c:\_users\junggon\works\projects\toyota_manip\data\openrave_source\openrave_1725\plugins\rmanipulation\taskcaging.h(923)
> : error C3861: 'RavePrintfA_INFOLEVEL': identifier not found
> 7>c:\_users\junggon\works\projects\toyota_manip\data\openrave_source\openrave_1725\plugins\rmanipulation\taskcaging.h(923)
> : error C3861: 'RavePrintfA_INFOLEVEL': identifier not found
> 7>c:\_users\junggon\works\projects\toyota_manip\data\openrave_source\openrave_1725\plugins\rmanipulation\visualfeedback.h(612)
> : error C2039: 'RavePrintfA_INFOLEVEL' : is not a member of 'OpenRAVE'
> 7>c:\_users\junggon\works\projects\toyota_manip\data\openrave_source\openrave_1725\plugins\rmanipulation\visualfeedback.h(612)
> : error C2039: 'RavePrintfA_INFOLEVEL' : is not a member of 'OpenRAVE'
> 7>c:\_users\junggon\works\projects\toyota_manip\data\openrave_source\openrave_1725\plugins\rmanipulation\visualfeedback.h(612)
> : error C3861: 'RavePrintfA_INFOLEVEL': identifier not found
> 7>c:\_users\junggon\works\projects\toyota_manip\data\openrave_source\openrave_1725\plugins\rmanipulation\visualfeedback.h(612)
> : error C3861: 'RavePrintfA_INFOLEVEL': identifier not found
> 7>c:\_users\junggon\works\projects\toyota_manip\data\openrave_source\openrave_1725\plugins\rmanipulation\visualfeedback.h(975)
> : error C2039: 'RavePrintfA_INFOLEVEL' : is not a member of 'OpenRAVE'
> 7>c:\_users\junggon\works\projects\toyota_manip\data\openrave_source\openrave_1725\plugins\rmanipulation\visualfeedback.h(975)
> : error C2039: 'RavePrintfA_INFOLEVEL' : is not a member of 'OpenRAVE'
> 7>c:\_users\junggon\works\projects\toyota_manip\data\openrave_source\openrave_1725\plugins\rmanipulation\visualfeedback.h(975)
> : error C3861: 'RavePrintfA_INFOLEVEL': identifier not found
> 7>c:\_users\junggon\works\projects\toyota_manip\data\openrave_source\openrave_1725\plugins\rmanipulation\visualfeedback.h(975)
> : error C3861: 'RavePrintfA_INFOLEVEL': identifier not found
> 7>c:\_users\junggon\works\projects\toyota_manip\data\openrave_source\openrave_1725\plugins\rmanipulation\visualfeedback.h(1059)
> : error C2039: 'RavePrintfA_INFOLEVEL' : is not a member of 'OpenRAVE'
> 7>c:\_users\junggon\works\projects\toyota_manip\data\openrave_source\openrave_1725\plugins\rmanipulation\visualfeedback.h(1059)
> : error C2039: 'RavePrintfA_INFOLEVEL' : is not a member of 'OpenRAVE'
> 7>c:\_users\junggon\works\projects\toyota_manip\data\openrave_source\openrave_1725\plugins\rmanipulation\visualfeedback.h(1059)
> : error C3861: 'RavePrintfA_INFOLEVEL': identifier not found
> 7>c:\_users\junggon\works\projects\toyota_manip\data\openrave_source\openrave_1725\plugins\rmanipulation\visualfeedback.h(1059)
> : error C3861: 'RavePrintfA_INFOLEVEL': identifier not found
> 7>c:\_users\junggon\works\projects\toyota_manip\data\openrave_source\openrave_1725\plugins\rmanipulation\visualfeedback.h(1068)
> : error C2039: 'RavePrintfA_INFOLEVEL' : is not a member of 'OpenRAVE'
> 7>c:\_users\junggon\works\projects\toyota_manip\data\openrave_source\openrave_1725\plugins\rmanipulation\visualfeedback.h(1068)
> : error C2039: 'RavePrintfA_INFOLEVEL' : is not a member of 'OpenRAVE'
> 7>c:\_users\junggon\works\projects\toyota_manip\data\openrave_source\openrave_1725\plugins\rmanipulation\visualfeedback.h(1068)
> : error C3861: 'RavePrintfA_INFOLEVEL': identifier not found
> 7>c:\_users\junggon\works\projects\toyota_manip\data\openrave_source\openrave_1725\plugins\rmanipulation\visualfeedback.h(1068)
> : error C3861: 'RavePrintfA_INFOLEVEL': identifier not found
> 7>c:\_users\junggon\works\projects\toyota_manip\data\openrave_source\openrave_1725\plugins\rmanipulation\visualfeedback.h(1075)
> : error C2039: 'RavePrintfA_INFOLEVEL' : is not a member of 'OpenRAVE'
> 7>c:\_users\junggon\works\projects\toyota_manip\data\openrave_source\openrave_1725\plugins\rmanipulation\visualfeedback.h(1075)
> : error C2039: 'RavePrintfA_INFOLEVEL' : is not a member of 'OpenRAVE'
> 7>c:\_users\junggon\works\projects\toyota_manip\data\openrave_source\openrave_1725\plugins\rmanipulation\visualfeedback.h(1075)
> : error C3861: 'RavePrintfA_INFOLEVEL': identifier not found
> 7>c:\_users\junggon\works\projects\toyota_manip\data\openrave_source\openrave_1725\plugins\rmanipulation\visualfeedback.h(1075)
> : error C3861: 'RavePrintfA_INFOLEVEL': identifier not found
> 7>c:\_users\junggon\works\projects\toyota_manip\data\openrave_source\openrave_1725\plugins\rmanipulation\visualfeedback.h(1162)
> : error C2039: 'RavePrintfA_INFOLEVEL' : is not a member of 'OpenRAVE'
> 7>c:\_users\junggon\works\projects\toyota_manip\data\openrave_source\openrave_1725\plugins\rmanipulation\visualfeedback.h(1162)
> : error C2039: 'RavePrintfA_INFOLEVEL' : is not a member of 'OpenRAVE'
> 7>c:\_users\junggon\works\projects\toyota_manip\data\openrave_source\openrave_1725\plugins\rmanipulation\visualfeedback.h(1162)
> : error C3861: 'RavePrintfA_INFOLEVEL': identifier not found
> 7>c:\_users\junggon\works\projects\toyota_manip\data\openrave_source\openrave_1725\plugins\rmanipulation\visualfeedback.h(1162)
> : error C3861: 'RavePrintfA_INFOLEVEL': identifier not found
> 7>c:\_users\junggon\works\projects\toyota_manip\data\openrave_source\openrave_1725\plugins\rmanipulation\visualfeedback.h(1175)
> : error C2039: 'RavePrintfA_INFOLEVEL' : is not a member of 'OpenRAVE'
> 7>c:\_users\junggon\works\projects\toyota_manip\data\openrave_source\openrave_1725\plugins\rmanipulation\visualfeedback.h(1175)
> : error C2039: 'RavePrintfA_INFOLEVEL' : is not a member of 'OpenRAVE'
> 7>c:\_users\junggon\works\projects\toyota_manip\data\openrave_source\openrave_1725\plugins\rmanipulation\visualfeedback.h(1175)
> : error C3861: 'RavePrintfA_INFOLEVEL': identifier not found
> 7>c:\_users\junggon\works\projects\toyota_manip\data\openrave_source\openrave_1725\plugins\rmanipulation\visualfeedback.h(1175)
> : error C3861: 'RavePrintfA_INFOLEVEL': identifier not found
> 7>Build log was saved at
> "file://c:\_Users\Junggon\Works\Projects\toyota_manip\data\openrave_source\OpenRAVE_1725\build\plugins\rmanipulation\rmanipulation.dir\Release\BuildLog.htm"
> 7>rmanipulation - 60 error(s), 8 warning(s)
> 9>using native typeof
> 9>c:\_users\junggon\works\projects\toyota_manip\data\openrave_source\openrave_1725\python\bindings\bindings.h(294)
> : warning C4244: 'argument' : conversion from 'uint64_t' to 'size_t',
> possible loss of data
> 9>c:\_users\junggon\works\projects\toyota_manip\data\openrave_source\openrave_1725\python\bindings\bindings.h(320)
> : warning C4244: 'argument' : conversion from 'uint64_t' to 'size_t',
> possible loss of data
> 9>c:\_users\junggon\works\projects\toyota_manip\data\openrave_source\openrave_1725\python\bindings\bindings.h(335)
> : warning C4244: 'argument' : conversion from 'uint64_t' to 'size_t',
> possible loss of data
> 9>..\..\..\python\bindings\openravepy_int.cpp(1365) : error C2039:
> 'RavePrintfA_INFOLEVEL' : is not a member of 'OpenRAVE'
> 9>..\..\..\python\bindings\openravepy_int.cpp(1365) : error C2039:
> 'RavePrintfA_INFOLEVEL' : is not a member of 'OpenRAVE'
> 9>..\..\..\python\bindings\openravepy_int.cpp(1365) : error C3861:
> 'RavePrintfA_INFOLEVEL': identifier not found
> 9>..\..\..\python\bindings\openravepy_int.cpp(1365) : error C3861:
> 'RavePrintfA_INFOLEVEL': identifier not found
> 9>..\..\..\python\bindings\openravepy_int.cpp(2841) : error C2039:
> 'RavePrintfA_INFOLEVEL' : is not a member of 'OpenRAVE'
> 9>..\..\..\python\bindings\openravepy_int.cpp(2841) : error C2039:
> 'RavePrintfA_INFOLEVEL' : is not a member of 'OpenRAVE'
> 9>..\..\..\python\bindings\openravepy_int.cpp(2841) : error C3861:
> 'RavePrintfA_INFOLEVEL': identifier not found
> 9>..\..\..\python\bindings\openravepy_int.cpp(2841) : error C3861:
> 'RavePrintfA_INFOLEVEL': identifier not found
> 9>Build log was saved at
> "file://c:\_Users\Junggon\Works\Projects\toyota_manip\data\openrave_source\OpenRAVE_1725\build\python\bindings\openravepy_int.dir\Release\BuildLog.htm"
> 9>openravepy_int - 8 error(s), 4 warning(s)
> ========== Build: 0 succeeded, 9 failed, 31 up-to-date, 0 skipped ==========
>
> ------------------------------------------------------------------------------
> Automate Storage Tiering Simply
> Optimize IT performance and efficiency through flexible, powerful,
> automated storage tiering capabilities. View this brief to learn how
> you can reduce costs and improve performance.
> http://p.sf.net/sfu/dell-sfdev2dev
> _______________________________________________
> Openrave-users mailing list
> [hidden email]
> https://lists.sourceforge.net/lists/listinfo/openrave-users
>

------------------------------------------------------------------------------
Automate Storage Tiering Simply
Optimize IT performance and efficiency through flexible, powerful,
automated storage tiering capabilities. View this brief to learn how
you can reduce costs and improve performance.
http://p.sf.net/sfu/dell-sfdev2dev
_______________________________________________
Openrave-users mailing list
[hidden email]
https://lists.sourceforge.net/lists/listinfo/openrave-users