Problem compiling openrave-master on mac os x 10.9.5

classic Classic list List threaded Threaded
1 message Options
Reply | Threaded
Open this post in threaded view
|

Problem compiling openrave-master on mac os x 10.9.5

kpax
Hello everybody,
I am trying to compile on mavericks, and I have this error:

[ 78%] Generating moc_qtcoinviewer.cxx
usr/local/Cellar/boost/1.57.0/include/boost/type_traits/detail/has_binary_operator.hp:50: Parse error at "BOOST_JOIN"
make[2]: *** [plugins/qtcoinrave/moc_qtcoinviewer.cxx] Error 1
make[1]: *** [plugins/qtcoinrave/CMakeFiles/qtcoinrave.dir/all] Error 2
make: *** [all] Error 2

It seems there is the same error but for past versions of mac.
Any ideas to solve it ?

Thank you.