Quantcast

problems building svn 277?

classic Classic list List threaded Threaded
3 messages Options
Reply | Threaded
Open this post in threaded view
|  
Report Content as Inappropriate

problems building svn 277?

Paul E. Rybski
Hi,
        I just updated to svn version 277 and did a 'sh build.all all' command
at the command prompt.  However, it died when building playerrave:

-------------------
Building PlayerRave
-------------------
checking build system type... i686-pc-linux-gnu
checking host system type... i686-pc-linux-gnu
checking target system type... i686-pc-linux-gnu
checking host system type... (cached) i686-pc-linux-gnu
checking for a BSD-compatible install... /usr/bin/install -c
checking whether build environment is sane... yes
checking for a thread-safe mkdir -p... /bin/mkdir -p
checking for gawk... gawk
checking whether make sets $(MAKE)... yes
checking for gcc... gcc
checking for C compiler default output file name... a.out
checking whether the C compiler works... yes
checking whether we are cross compiling... no
checking for suffix of executables...
checking for suffix of object files... o
checking whether we are using the GNU C compiler... yes
checking whether gcc accepts -g... yes
checking for gcc option to accept ISO C89... none needed
checking for style of include used by make... GNU
checking dependency style of gcc... gcc3
checking for gcc... gcc
checking whether we are using the GNU C++ compiler... yes
checking whether gcc accepts -g... yes
checking dependency style of gcc... gcc3
checking how to run the C preprocessor... gcc -E
checking for a BSD-compatible install... /usr/bin/install -c
checking for ranlib... ranlib
checking dependency style of gcc... gcc3
checking debug build... no
checking for _aligned_malloc... no
checking for _aligned_free... no
checking for a x86-64 CPU... no
checking for rave-config... rave-config
checking for ode-config... ode-config
checking player... yes
configure: creating ./config.status
config.status: creating Makefile
config.status: executing depfiles commands
Configuration:
   Target system type:    i686-pc-linux-gnu
   x86-64 build?        no
   Debug build?         no
   Installing to:  /home/prybski/soft-dist/openrave/bin/plugins
test -z "libplayerrave.a" || rm -f libplayerrave.a
test -z "playerrave.so.0.1" || rm -f playerrave.so.0.1
rm -f *.o
gcc -DPACKAGE_NAME=\"playerrave\" -DPACKAGE_TARNAME=\"playerrave\"
-DPACKAGE_VERSION=\"0.1\" -DPACKAGE_STRING=\"playerrave\ 0.1\"
-DPACKAGE_BUGREPORT=\"[hidden email]\" -DPACKAGE=\"playerrave\"
-DVERSION=\"0.1\" -I.   -O2 -fomit-frame-pointer   -O2
-fomit-frame-pointer  -I/home/prybski/soft-dist/openrave/include
-I/usr/local/include -D_POSIX_PTHREAD_SEMANTICS -D_REENTRANT
-I/usr/local/include/player-2.1   -MT playerravemain.o -MD -MP -MF
.deps/playerravemain.Tpo -c -o playerravemain.o playerravemain.cpp
mv -f .deps/playerravemain.Tpo .deps/playerravemain.Po
gcc -DPACKAGE_NAME=\"playerrave\" -DPACKAGE_TARNAME=\"playerrave\"
-DPACKAGE_VERSION=\"0.1\" -DPACKAGE_STRING=\"playerrave\ 0.1\"
-DPACKAGE_BUGREPORT=\"[hidden email]\" -DPACKAGE=\"playerrave\"
-DVERSION=\"0.1\" -I.   -O2 -fomit-frame-pointer   -O2
-fomit-frame-pointer  -I/home/prybski/soft-dist/openrave/include
-I/usr/local/include -D_POSIX_PTHREAD_SEMANTICS -D_REENTRANT
-I/usr/local/include/player-2.1   -MT playercontroller.o -MD -MP -MF
.deps/playercontroller.Tpo -c -o playercontroller.o playercontroller.cpp
playercontroller.cpp: In member function ‘virtual void
PlayerController::Reset(int)’:
playercontroller.cpp:281: error: ‘PLAYER_ACTARRAY_POWER_OFF’ was not
declared in this scope
playercontroller.cpp:283: error: ‘PLAYER_ACTARRAY_POWER_ON’ was not
declared in this scope
playercontroller.cpp: In member function ‘virtual bool
PlayerController::SetPath(const OpenRAVE::Trajectory*, int, float)’:
playercontroller.cpp:344: error:
‘PLAYER_ACTARRAY_TRAJFMT_FLAG_SYNCEXECUTION’ was not declared in this scope
playercontroller.cpp:346: error:
‘PLAYER_ACTARRAY_TRAJFMT_FLAG_TIMESTAMPS’ was not declared in this scope
playercontroller.cpp:348: error:
‘PLAYER_ACTARRAY_TRAJFMT_FLAG_HOLD_ON_STALL’ was not declared in this scope
playercontroller.cpp:375: error: ‘class PlayerCc::ActArrayProxy’ has no
member named ‘MoveWithTrajectory’
playercontroller.cpp: In member function ‘void
PlayerController::RunThread()’:
playercontroller.cpp:728: error: ‘class PlayerCc::ActArrayProxy’ has no
member named ‘GetTrajectoryId’
playercontroller.cpp:729: error: ‘class PlayerCc::ActArrayProxy’ has no
member named ‘GetTrajectoryTime’
playercontroller.cpp:771: error: ‘PLAYER_ACTARRAY_ACTSTATE_READY’ was
not declared in this scope
playercontroller.cpp:836: error: ‘class PlayerCc::ActArrayProxy’ has no
member named ‘Start’
playercontroller.cpp:870: error: ‘PLAYER_ACTARRAY_POWER_OFF’ was not
declared in this scope
playercontroller.cpp:877: error: ‘PLAYER_ACTARRAY_POWER_ON’ was not
declared in this scope
playercontroller.cpp:890: error: ‘PLAYER_ACTARRAY_POWER_CANCELCURRENT’
was not declared in this scope
playercontroller.cpp:912: error: ‘PLAYER_ACTARRAY_POWER_CANCELCURRENT’
was not declared in this scope
playercontroller.cpp:931: error: ‘class PlayerCc::ActArrayProxy’ has no
member named ‘Start’
playercontroller.cpp:961: error: ‘PLAYER_ACTARRAY_POWER_CANCELCURRENT’
was not declared in this scope
make: *** [playercontroller.o] Error 1

-----------------------------------------------------
-----------------------------------------------------
Add this to .bashrc (orequivalent startup login file) if paths not
already included:
export PATH=$PATH:/home/prybski/soft-dist/openrave/bin
export LD_LIBRARY_PATH=$LD_LIBRARY_PATH:/home/prybski/soft-dist/openrave/lib
-----------------------------------------------------
-----------------------------------------------------
prybski@hammerhead:~/soft-dist/openrave$ svn info
Path: .
URL: https://openrave.svn.sourceforge.net/svnroot/openrave
Repository Root: https://openrave.svn.sourceforge.net/svnroot/openrave
Repository UUID: 9e016c41-b246-0410-9d68-e1838aa46861
Revision: 277
Node Kind: directory
Schedule: normal
Last Changed Author: rdiankov
Last Changed Rev: 277
Last Changed Date: 2008-07-21 15:31:17 -0400 (Mon, 21 Jul 2008)


Any thoughts?

-Paul

--
Paul E. Rybski, Ph.D., Systems Scientist
The Robotics Institute, Carnegie Mellon University
Phone: 412-268-7417, Fax: 412-268-7350
Web: http://www.cs.cmu.edu/~prybski


Reply | Threaded
Open this post in threaded view
|  
Report Content as Inappropriate

Re: problems building svn 277?

Rosen Diankov-2
This message just means the player plugin didn't compile properly. The
reason you are getting it is that you have player installed on your
machine, but the patches necessary for the plugin to work. I'll add
some code in there to detect this condition and not give the error
messages.

rosen,

2008/7/21 Paul E. Rybski <[hidden email]>:

> Hi,
>        I just updated to svn version 277 and did a 'sh build.all all' command
> at the command prompt.  However, it died when building playerrave:
>
> -------------------
> Building PlayerRave
> -------------------
> checking build system type... i686-pc-linux-gnu
> checking host system type... i686-pc-linux-gnu
> checking target system type... i686-pc-linux-gnu
> checking host system type... (cached) i686-pc-linux-gnu
> checking for a BSD-compatible install... /usr/bin/install -c
> checking whether build environment is sane... yes
> checking for a thread-safe mkdir -p... /bin/mkdir -p
> checking for gawk... gawk
> checking whether make sets $(MAKE)... yes
> checking for gcc... gcc
> checking for C compiler default output file name... a.out
> checking whether the C compiler works... yes
> checking whether we are cross compiling... no
> checking for suffix of executables...
> checking for suffix of object files... o
> checking whether we are using the GNU C compiler... yes
> checking whether gcc accepts -g... yes
> checking for gcc option to accept ISO C89... none needed
> checking for style of include used by make... GNU
> checking dependency style of gcc... gcc3
> checking for gcc... gcc
> checking whether we are using the GNU C++ compiler... yes
> checking whether gcc accepts -g... yes
> checking dependency style of gcc... gcc3
> checking how to run the C preprocessor... gcc -E
> checking for a BSD-compatible install... /usr/bin/install -c
> checking for ranlib... ranlib
> checking dependency style of gcc... gcc3
> checking debug build... no
> checking for _aligned_malloc... no
> checking for _aligned_free... no
> checking for a x86-64 CPU... no
> checking for rave-config... rave-config
> checking for ode-config... ode-config
> checking player... yes
> configure: creating ./config.status
> config.status: creating Makefile
> config.status: executing depfiles commands
> Configuration:
>   Target system type:    i686-pc-linux-gnu
>   x86-64 build?        no
>   Debug build?         no
>   Installing to:  /home/prybski/soft-dist/openrave/bin/plugins
> test -z "libplayerrave.a" || rm -f libplayerrave.a
> test -z "playerrave.so.0.1" || rm -f playerrave.so.0.1
> rm -f *.o
> gcc -DPACKAGE_NAME=\"playerrave\" -DPACKAGE_TARNAME=\"playerrave\"
> -DPACKAGE_VERSION=\"0.1\" -DPACKAGE_STRING=\"playerrave\ 0.1\"
> -DPACKAGE_BUGREPORT=\"[hidden email]\" -DPACKAGE=\"playerrave\"
> -DVERSION=\"0.1\" -I.   -O2 -fomit-frame-pointer   -O2
> -fomit-frame-pointer  -I/home/prybski/soft-dist/openrave/include
> -I/usr/local/include -D_POSIX_PTHREAD_SEMANTICS -D_REENTRANT
> -I/usr/local/include/player-2.1   -MT playerravemain.o -MD -MP -MF
> .deps/playerravemain.Tpo -c -o playerravemain.o playerravemain.cpp
> mv -f .deps/playerravemain.Tpo .deps/playerravemain.Po
> gcc -DPACKAGE_NAME=\"playerrave\" -DPACKAGE_TARNAME=\"playerrave\"
> -DPACKAGE_VERSION=\"0.1\" -DPACKAGE_STRING=\"playerrave\ 0.1\"
> -DPACKAGE_BUGREPORT=\"[hidden email]\" -DPACKAGE=\"playerrave\"
> -DVERSION=\"0.1\" -I.   -O2 -fomit-frame-pointer   -O2
> -fomit-frame-pointer  -I/home/prybski/soft-dist/openrave/include
> -I/usr/local/include -D_POSIX_PTHREAD_SEMANTICS -D_REENTRANT
> -I/usr/local/include/player-2.1   -MT playercontroller.o -MD -MP -MF
> .deps/playercontroller.Tpo -c -o playercontroller.o playercontroller.cpp
> playercontroller.cpp: In member function 'virtual void
> PlayerController::Reset(int)':
> playercontroller.cpp:281: error: 'PLAYER_ACTARRAY_POWER_OFF' was not
> declared in this scope
> playercontroller.cpp:283: error: 'PLAYER_ACTARRAY_POWER_ON' was not
> declared in this scope
> playercontroller.cpp: In member function 'virtual bool
> PlayerController::SetPath(const OpenRAVE::Trajectory*, int, float)':
> playercontroller.cpp:344: error:
> 'PLAYER_ACTARRAY_TRAJFMT_FLAG_SYNCEXECUTION' was not declared in this scope
> playercontroller.cpp:346: error:
> 'PLAYER_ACTARRAY_TRAJFMT_FLAG_TIMESTAMPS' was not declared in this scope
> playercontroller.cpp:348: error:
> 'PLAYER_ACTARRAY_TRAJFMT_FLAG_HOLD_ON_STALL' was not declared in this scope
> playercontroller.cpp:375: error: 'class PlayerCc::ActArrayProxy' has no
> member named 'MoveWithTrajectory'
> playercontroller.cpp: In member function 'void
> PlayerController::RunThread()':
> playercontroller.cpp:728: error: 'class PlayerCc::ActArrayProxy' has no
> member named 'GetTrajectoryId'
> playercontroller.cpp:729: error: 'class PlayerCc::ActArrayProxy' has no
> member named 'GetTrajectoryTime'
> playercontroller.cpp:771: error: 'PLAYER_ACTARRAY_ACTSTATE_READY' was
> not declared in this scope
> playercontroller.cpp:836: error: 'class PlayerCc::ActArrayProxy' has no
> member named 'Start'
> playercontroller.cpp:870: error: 'PLAYER_ACTARRAY_POWER_OFF' was not
> declared in this scope
> playercontroller.cpp:877: error: 'PLAYER_ACTARRAY_POWER_ON' was not
> declared in this scope
> playercontroller.cpp:890: error: 'PLAYER_ACTARRAY_POWER_CANCELCURRENT'
> was not declared in this scope
> playercontroller.cpp:912: error: 'PLAYER_ACTARRAY_POWER_CANCELCURRENT'
> was not declared in this scope
> playercontroller.cpp:931: error: 'class PlayerCc::ActArrayProxy' has no
> member named 'Start'
> playercontroller.cpp:961: error: 'PLAYER_ACTARRAY_POWER_CANCELCURRENT'
> was not declared in this scope
> make: *** [playercontroller.o] Error 1
>
> -----------------------------------------------------
> -----------------------------------------------------
> Add this to .bashrc (orequivalent startup login file) if paths not
> already included:
> export PATH=$PATH:/home/prybski/soft-dist/openrave/bin
> export LD_LIBRARY_PATH=$LD_LIBRARY_PATH:/home/prybski/soft-dist/openrave/lib
> -----------------------------------------------------
> -----------------------------------------------------
> prybski@hammerhead:~/soft-dist/openrave$ svn info
> Path: .
> URL: https://openrave.svn.sourceforge.net/svnroot/openrave
> Repository Root: https://openrave.svn.sourceforge.net/svnroot/openrave
> Repository UUID: 9e016c41-b246-0410-9d68-e1838aa46861
> Revision: 277
> Node Kind: directory
> Schedule: normal
> Last Changed Author: rdiankov
> Last Changed Rev: 277
> Last Changed Date: 2008-07-21 15:31:17 -0400 (Mon, 21 Jul 2008)
>
>
> Any thoughts?
>
> -Paul
>
> --
> Paul E. Rybski, Ph.D., Systems Scientist
> The Robotics Institute, Carnegie Mellon University
> Phone: 412-268-7417, Fax: 412-268-7350
> Web: http://www.cs.cmu.edu/~prybski
>
> -------------------------------------------------------------------------
> This SF.Net email is sponsored by the Moblin Your Move Developer's challenge
> Build the coolest Linux based applications with Moblin SDK & win great prizes
> Grand prize is a trip for two to an Open Source event anywhere in the world
> http://moblin-contest.org/redirect.php?banner_id=100&url=/
> _______________________________________________
> Openrave-users mailing list
> [hidden email]
> https://lists.sourceforge.net/lists/listinfo/openrave-users
>


Reply | Threaded
Open this post in threaded view
|  
Report Content as Inappropriate

Re: problems building svn 277?

Rosen Diankov-2
"but not the patches necessary for the plugin to work."

In other words, the error messages are harmless.

rosen,

2008/7/21 Rosen Diankov <[hidden email]>:

> This message just means the player plugin didn't compile properly. The
> reason you are getting it is that you have player installed on your
> machine, but the patches necessary for the plugin to work. I'll add
> some code in there to detect this condition and not give the error
> messages.
>
> rosen,
>
> 2008/7/21 Paul E. Rybski <[hidden email]>:
>> Hi,
>>        I just updated to svn version 277 and did a 'sh build.all all' command
>> at the command prompt.  However, it died when building playerrave:
>>
>> -------------------
>> Building PlayerRave
>> -------------------
>> checking build system type... i686-pc-linux-gnu
>> checking host system type... i686-pc-linux-gnu
>> checking target system type... i686-pc-linux-gnu
>> checking host system type... (cached) i686-pc-linux-gnu
>> checking for a BSD-compatible install... /usr/bin/install -c
>> checking whether build environment is sane... yes
>> checking for a thread-safe mkdir -p... /bin/mkdir -p
>> checking for gawk... gawk
>> checking whether make sets $(MAKE)... yes
>> checking for gcc... gcc
>> checking for C compiler default output file name... a.out
>> checking whether the C compiler works... yes
>> checking whether we are cross compiling... no
>> checking for suffix of executables...
>> checking for suffix of object files... o
>> checking whether we are using the GNU C compiler... yes
>> checking whether gcc accepts -g... yes
>> checking for gcc option to accept ISO C89... none needed
>> checking for style of include used by make... GNU
>> checking dependency style of gcc... gcc3
>> checking for gcc... gcc
>> checking whether we are using the GNU C++ compiler... yes
>> checking whether gcc accepts -g... yes
>> checking dependency style of gcc... gcc3
>> checking how to run the C preprocessor... gcc -E
>> checking for a BSD-compatible install... /usr/bin/install -c
>> checking for ranlib... ranlib
>> checking dependency style of gcc... gcc3
>> checking debug build... no
>> checking for _aligned_malloc... no
>> checking for _aligned_free... no
>> checking for a x86-64 CPU... no
>> checking for rave-config... rave-config
>> checking for ode-config... ode-config
>> checking player... yes
>> configure: creating ./config.status
>> config.status: creating Makefile
>> config.status: executing depfiles commands
>> Configuration:
>>   Target system type:    i686-pc-linux-gnu
>>   x86-64 build?        no
>>   Debug build?         no
>>   Installing to:  /home/prybski/soft-dist/openrave/bin/plugins
>> test -z "libplayerrave.a" || rm -f libplayerrave.a
>> test -z "playerrave.so.0.1" || rm -f playerrave.so.0.1
>> rm -f *.o
>> gcc -DPACKAGE_NAME=\"playerrave\" -DPACKAGE_TARNAME=\"playerrave\"
>> -DPACKAGE_VERSION=\"0.1\" -DPACKAGE_STRING=\"playerrave\ 0.1\"
>> -DPACKAGE_BUGREPORT=\"[hidden email]\" -DPACKAGE=\"playerrave\"
>> -DVERSION=\"0.1\" -I.   -O2 -fomit-frame-pointer   -O2
>> -fomit-frame-pointer  -I/home/prybski/soft-dist/openrave/include
>> -I/usr/local/include -D_POSIX_PTHREAD_SEMANTICS -D_REENTRANT
>> -I/usr/local/include/player-2.1   -MT playerravemain.o -MD -MP -MF
>> .deps/playerravemain.Tpo -c -o playerravemain.o playerravemain.cpp
>> mv -f .deps/playerravemain.Tpo .deps/playerravemain.Po
>> gcc -DPACKAGE_NAME=\"playerrave\" -DPACKAGE_TARNAME=\"playerrave\"
>> -DPACKAGE_VERSION=\"0.1\" -DPACKAGE_STRING=\"playerrave\ 0.1\"
>> -DPACKAGE_BUGREPORT=\"[hidden email]\" -DPACKAGE=\"playerrave\"
>> -DVERSION=\"0.1\" -I.   -O2 -fomit-frame-pointer   -O2
>> -fomit-frame-pointer  -I/home/prybski/soft-dist/openrave/include
>> -I/usr/local/include -D_POSIX_PTHREAD_SEMANTICS -D_REENTRANT
>> -I/usr/local/include/player-2.1   -MT playercontroller.o -MD -MP -MF
>> .deps/playercontroller.Tpo -c -o playercontroller.o playercontroller.cpp
>> playercontroller.cpp: In member function 'virtual void
>> PlayerController::Reset(int)':
>> playercontroller.cpp:281: error: 'PLAYER_ACTARRAY_POWER_OFF' was not
>> declared in this scope
>> playercontroller.cpp:283: error: 'PLAYER_ACTARRAY_POWER_ON' was not
>> declared in this scope
>> playercontroller.cpp: In member function 'virtual bool
>> PlayerController::SetPath(const OpenRAVE::Trajectory*, int, float)':
>> playercontroller.cpp:344: error:
>> 'PLAYER_ACTARRAY_TRAJFMT_FLAG_SYNCEXECUTION' was not declared in this scope
>> playercontroller.cpp:346: error:
>> 'PLAYER_ACTARRAY_TRAJFMT_FLAG_TIMESTAMPS' was not declared in this scope
>> playercontroller.cpp:348: error:
>> 'PLAYER_ACTARRAY_TRAJFMT_FLAG_HOLD_ON_STALL' was not declared in this scope
>> playercontroller.cpp:375: error: 'class PlayerCc::ActArrayProxy' has no
>> member named 'MoveWithTrajectory'
>> playercontroller.cpp: In member function 'void
>> PlayerController::RunThread()':
>> playercontroller.cpp:728: error: 'class PlayerCc::ActArrayProxy' has no
>> member named 'GetTrajectoryId'
>> playercontroller.cpp:729: error: 'class PlayerCc::ActArrayProxy' has no
>> member named 'GetTrajectoryTime'
>> playercontroller.cpp:771: error: 'PLAYER_ACTARRAY_ACTSTATE_READY' was
>> not declared in this scope
>> playercontroller.cpp:836: error: 'class PlayerCc::ActArrayProxy' has no
>> member named 'Start'
>> playercontroller.cpp:870: error: 'PLAYER_ACTARRAY_POWER_OFF' was not
>> declared in this scope
>> playercontroller.cpp:877: error: 'PLAYER_ACTARRAY_POWER_ON' was not
>> declared in this scope
>> playercontroller.cpp:890: error: 'PLAYER_ACTARRAY_POWER_CANCELCURRENT'
>> was not declared in this scope
>> playercontroller.cpp:912: error: 'PLAYER_ACTARRAY_POWER_CANCELCURRENT'
>> was not declared in this scope
>> playercontroller.cpp:931: error: 'class PlayerCc::ActArrayProxy' has no
>> member named 'Start'
>> playercontroller.cpp:961: error: 'PLAYER_ACTARRAY_POWER_CANCELCURRENT'
>> was not declared in this scope
>> make: *** [playercontroller.o] Error 1
>>
>> -----------------------------------------------------
>> -----------------------------------------------------
>> Add this to .bashrc (orequivalent startup login file) if paths not
>> already included:
>> export PATH=$PATH:/home/prybski/soft-dist/openrave/bin
>> export LD_LIBRARY_PATH=$LD_LIBRARY_PATH:/home/prybski/soft-dist/openrave/lib
>> -----------------------------------------------------
>> -----------------------------------------------------
>> prybski@hammerhead:~/soft-dist/openrave$ svn info
>> Path: .
>> URL: https://openrave.svn.sourceforge.net/svnroot/openrave
>> Repository Root: https://openrave.svn.sourceforge.net/svnroot/openrave
>> Repository UUID: 9e016c41-b246-0410-9d68-e1838aa46861
>> Revision: 277
>> Node Kind: directory
>> Schedule: normal
>> Last Changed Author: rdiankov
>> Last Changed Rev: 277
>> Last Changed Date: 2008-07-21 15:31:17 -0400 (Mon, 21 Jul 2008)
>>
>>
>> Any thoughts?
>>
>> -Paul
>>
>> --
>> Paul E. Rybski, Ph.D., Systems Scientist
>> The Robotics Institute, Carnegie Mellon University
>> Phone: 412-268-7417, Fax: 412-268-7350
>> Web: http://www.cs.cmu.edu/~prybski
>>
>> -------------------------------------------------------------------------
>> This SF.Net email is sponsored by the Moblin Your Move Developer's challenge
>> Build the coolest Linux based applications with Moblin SDK & win great prizes
>> Grand prize is a trip for two to an Open Source event anywhere in the world
>> http://moblin-contest.org/redirect.php?banner_id=100&url=/
>> _______________________________________________
>> Openrave-users mailing list
>> [hidden email]
>> https://lists.sourceforge.net/lists/listinfo/openrave-users
>>
>


Loading...